Gentoo Websites Logo
Go to: Gentoo Home Documentation Forums Lists Bugs Planet Store Wiki Get Gentoo!
Bug 670924 - net-mail/mailutils-3.4-r2: Functions printable, regex, char, argument strings, logical and FAILED on ppc
Summary: net-mail/mailutils-3.4-r2: Functions printable, regex, char, argument strings...
Status: CONFIRMED
Alias: None
Product: Gentoo Linux
Classification: Unclassified
Component: Current packages (show other bugs)
Hardware: All Linux
: Normal normal (vote)
Assignee: Eray Aslan
URL:
Whiteboard:
Keywords: TESTFAILURE
Depends on:
Blocks: 663264
  Show dependency tree
 
Reported: 2018-11-11 16:12 UTC by ernsteiswuerfel
Modified: 2019-09-13 22:52 UTC (History)
1 user (show)

See Also:
Package list:
Runtime testing required: ---


Attachments
build.log (mailutils-3.4-r2:20181111-153715.log,924.37 KB, text/plain)
2018-11-11 16:12 UTC, ernsteiswuerfel
Details
testsuite.log (testsuite.log,4.21 KB, text/plain)
2018-11-11 16:13 UTC, ernsteiswuerfel
Details
emerge --info (file_670924.txt,5.88 KB, text/plain)
2018-11-11 16:13 UTC, ernsteiswuerfel
Details

Note You need to log in before you can comment on or make changes to this bug.
Description ernsteiswuerfel 2018-11-11 16:12:56 UTC
Created attachment 554844 [details]
build.log

## ----------------------------- ##
## GNU Mailutils 3.4 test suite. ##
## ----------------------------- ##
  1: mimeview version                                ok
  2: default                                         ok
  3: suffixes                                        ok
  4: default ordering                                ok
  5: priority                                        ok

Functions

  6: match                                           ok
  7: ascii                                           ok
  8: printable                                       FAILED (testsuite.at:120)
  9: regex                                           FAILED (testsuite.at:128)
 10: string                                          ok
 11: istring                                         ok
 12: char                                            FAILED (testsuite.at:150)
 13: short                                           ok
 14: int                                             ok
 15: contains                                        ok
 16: argument strings                                FAILED (testsuite.at:180)
 17: logical or                                      ok
 18: logical and                                     FAILED (testsuite.at:200)
 19: grouping                                        ok
 20: error recovery                                  ok
 21: multiple error recovery                         ok

## ------------- ##
## Test results. ##
## ------------- ##

ERROR: All 21 tests were run,
5 failed unexpectedly.
Comment 1 ernsteiswuerfel 2018-11-11 16:13:19 UTC
Created attachment 554846 [details]
testsuite.log
Comment 2 ernsteiswuerfel 2018-11-11 16:13:49 UTC
Created attachment 554848 [details]
emerge --info
Comment 3 Matt Turner gentoo-dev 2019-09-13 22:52:07 UTC
Same failures in 3.7.