Gentoo Websites Logo
Go to: Gentoo Home Documentation Forums Lists Bugs Planet Store Wiki Get Gentoo!
Bug 664292 - app-editors/xemacs-21.5.34-r4 : Loading backquote.el...make[1]: *** [GNUmakefile:142: NEEDTODUMP]<snip> Segmentation fault
Summary: app-editors/xemacs-21.5.34-r4 : Loading backquote.el...make[1]: *** [GNUmake...
Status: UNCONFIRMED
Alias: None
Product: Gentoo Linux
Classification: Unclassified
Component: Current packages (show other bugs)
Hardware: All Linux
: Normal normal (vote)
Assignee: XEmacs team
URL:
Whiteboard:
Keywords:
Depends on:
Blocks:
 
Reported: 2018-08-22 17:14 UTC by Toralf Förster
Modified: 2018-08-25 18:59 UTC (History)
0 users

See Also:
Package list:
Runtime testing required: ---


Attachments
emerge-info.txt (emerge-info.txt,15.74 KB, text/plain)
2018-08-22 17:15 UTC, Toralf Förster
Details
app-editors:xemacs-21.5.34-r4:20180822-170401.log (app-editors:xemacs-21.5.34-r4:20180822-170401.log,205.41 KB, text/plain)
2018-08-22 17:15 UTC, Toralf Förster
Details
emerge-history.txt (emerge-history.txt,65.76 KB, text/plain)
2018-08-22 17:15 UTC, Toralf Förster
Details
environment (environment,93.01 KB, text/plain)
2018-08-22 17:15 UTC, Toralf Förster
Details
etc.portage.tbz2 (etc.portage.tbz2,11.94 KB, application/x-bzip)
2018-08-22 17:15 UTC, Toralf Förster
Details
logs.tbz2 (logs.tbz2,22.56 KB, application/x-bzip)
2018-08-22 17:15 UTC, Toralf Förster
Details
temp.tbz2 (temp.tbz2,36.69 KB, application/x-bzip)
2018-08-22 17:15 UTC, Toralf Förster
Details

Note You need to log in before you can comment on or make changes to this bug.
Description Toralf Förster gentoo-dev 2018-08-22 17:14:58 UTC
Using module-load-path (/var/tmp/portage/app-editors/xemacs-21.5.34-r4/work/xemacs-21.5.34/modules)
      Loading dumped-lisp.el...
      Loading backquote.el...make[1]: *** [GNUmakefile:142: NEEDTODUMP] Segmentation fault
make[1]: *** Deleting file 'NEEDTODUMP'
make[1]: Leaving directory '/var/tmp/portage/app-editors/xemacs-21.5.34-r4/work/xemacs-21.5.34/src'
make: *** [GNUmakefile:97: src] Error 2

  -------------------------------------------------------------------

  This is an unstable amd64 chroot image at a tinderbox (==build bot)
  name: 17.0-desktop_libressl_20180820-195837

  -------------------------------------------------------------------

gcc-config -l:
 [1] x86_64-pc-linux-gnu-8.2.0 *

Available Python interpreters, in order of preference:
  [1]   python3.6
  [2]   python2.7 (fallback)
Available Ruby profiles:
  [1]   ruby23 (with Rubygems) *
java-config:
The following VMs are available for generation-2:
*)	IcedTea JDK 3.8.0 [icedtea-bin-8]
Available Java Virtual Machines:
  [1]   icedtea-bin-8  system-vm

emerge -qpv app-editors/xemacs
[nomerge      ] app-editors/xemacs-21.5.34-r4  USE="X alsa berkdb gdbm gif gpm jpeg ldap libressl png tiff -Xaw3d -athena -canna -debug -dnd -eolconv -freewnn -motif -mule -nas -neXt -pop -postgres -xface -xft -xim" 
[ebuild  N    ]  app-xemacs/xemacs-base-2.46 
[ebuild  N    ]   app-editors/xemacs-21.5.34-r4  USE="X alsa berkdb gdbm gif gpm jpeg ldap libressl png tiff -Xaw3d -athena -canna -debug -dnd -eolconv -freewnn -motif -mule -nas -neXt -pop -postgres -xface -xft -xim"
Comment 1 Toralf Förster gentoo-dev 2018-08-22 17:15:02 UTC
Created attachment 544542 [details]
emerge-info.txt
Comment 2 Toralf Förster gentoo-dev 2018-08-22 17:15:05 UTC
Created attachment 544544 [details]
app-editors:xemacs-21.5.34-r4:20180822-170401.log
Comment 3 Toralf Förster gentoo-dev 2018-08-22 17:15:08 UTC
Created attachment 544546 [details]
emerge-history.txt
Comment 4 Toralf Förster gentoo-dev 2018-08-22 17:15:11 UTC
Created attachment 544548 [details]
environment
Comment 5 Toralf Förster gentoo-dev 2018-08-22 17:15:14 UTC
Created attachment 544550 [details]
etc.portage.tbz2
Comment 6 Toralf Förster gentoo-dev 2018-08-22 17:15:17 UTC
Created attachment 544552 [details]
logs.tbz2
Comment 7 Toralf Förster gentoo-dev 2018-08-22 17:15:20 UTC
Created attachment 544554 [details]
temp.tbz2
Comment 8 Mats Lidell gentoo-dev 2018-08-25 18:59:06 UTC
I have tried a number of times to recreate this error but with no success. I will check with upstream if there are any ideas.