Gentoo Websites Logo
Go to: Gentoo Home Documentation Forums Lists Bugs Planet Store Wiki Get Gentoo!
Bug 663638 - dev-libs/popt-1.16-r2 fails test test1 - 58 - Test "test1 --usage" failed with: "...lt-test1..." != "...test1..."
Summary: dev-libs/popt-1.16-r2 fails test test1 - 58 - Test "test1 --usage" failed wit...
Status: UNCONFIRMED
Alias: None
Product: Gentoo Linux
Classification: Unclassified
Component: Current packages (show other bugs)
Hardware: All Linux
: Normal normal (vote)
Assignee: Gentoo's Team for Core System packages
URL:
Whiteboard:
Keywords: TESTFAILURE
Depends on:
Blocks:
 
Reported: 2018-08-14 22:26 UTC by eroen
Modified: 2019-04-15 07:21 UTC (History)
2 users (show)

See Also:
Package list:
Runtime testing required: ---


Attachments
build.log (build.log,23.03 KB, text/plain)
2018-08-14 22:26 UTC, eroen
Details

Note You need to log in before you can comment on or make changes to this bug.
Description eroen 2018-08-14 22:26:23 UTC
Created attachment 543488 [details]
build.log

Running test test1 - 58.
Test "test1 --usage" failed with: "Usage: lt-test1 [-I?] [-c|--cb2=STRING] [--arg1] [-2|--arg2=ARG]
        [-3|--arg3=ANARG] [-onedash] [--optional=STRING] [--val]
        [-i|--int=INT] [-s|--short=SHORT] [-l|--long=LONG]
        [-L|--longlong=LONGLONG] [-f|--float=FLOAT] [-d|--double=DOUBLE]
        [--randint=INT] [--randshort=SHORT] [--randlong=LONG]
        [--randlonglong=LONGLONG] [--argv=STRING] [--bitset] [--bitclr]
        [--bitxor] [--nstr=STRING] [--lstr=STRING] [-I|--inc]
        [-c|--cb=STRING] [--longopt] [-?|--help] [--usage] [--simple=ARG]" != "Usage: test1 [-I?] [-c|--cb2=STRING] [--arg1] [-2|--arg2=ARG]
        [-3|--arg3=ANARG] [-onedash] [--optional=STRING] [--val]
        [-i|--int=INT] [-s|--short=SHORT] [-l|--long=LONG]
        [-L|--longlong=LONGLONG] [-f|--float=FLOAT] [-d|--double=DOUBLE]
        [--randint=INT] [--randshort=SHORT] [--randlong=LONG]
        [--randlonglong=LONGLONG] [--argv=STRING] [--bitset] [--bitclr]
        [--bitxor] [--nstr=STRING] [--lstr=STRING] [-I|--inc]
        [-c|--cb=STRING] [--longopt] [-?|--help] [--usage] [--simple=ARG]" 
FAIL: /var/tmp/portage/dev-libs/popt-1.16-r2/work/popt-1.16/testit.sh
====================================
1 of 1 test failed
Please report to popt-devel@rpm5.org
====================================
make[3]: *** [Makefile:757: check-TESTS] Error 1
make[3]: Leaving directory '/var/tmp/portage/dev-libs/popt-1.16-r2/work/popt-1.16-.arm64'
make[2]: *** [Makefile:1037: check-am] Error 2
make[2]: Leaving directory '/var/tmp/portage/dev-libs/popt-1.16-r2/work/popt-1.16-.arm64'
make[1]: *** [Makefile:628: check-recursive] Error 1
make[1]: Leaving directory '/var/tmp/portage/dev-libs/popt-1.16-r2/work/popt-1.16-.arm64'
make: *** [Makefile:1039: check] Error 2
 * ERROR: dev-libs/popt-1.16-r2::gentoo failed (test phase):
 *   Make check failed. See above for details.
 * 
 * Call stack:
 *            ebuild.sh, line  124:  Called src_test
 *          environment, line 2354:  Called multilib-minimal_src_test
 *          environment, line 1687:  Called multilib_foreach_abi 'multilib-minimal_abi_src_test'
 *          environment, line 1859:  Called multibuild_foreach_variant '_multilib_multibuild_wrapper' 'multilib-minimal_abi_src_test'
 *          environment, line 1552:  Called _multibuild_run '_multilib_multibuild_wrapper' 'multilib-minimal_abi_src_test'
 *          environment, line 1550:  Called _multilib_multibuild_wrapper 'multilib-minimal_abi_src_test'
 *          environment, line  312:  Called multilib-minimal_abi_src_test
 *          environment, line 1683:  Called default_src_test
 *   phase-functions.sh, line  896:  Called __eapi0_src_test
 *     phase-helpers.sh, line  816:  Called die
 * The specific snippet of code:
 *   		$emake_cmd ${internal_opts} check || \
 *   			die "Make check failed. See above for details."
Comment 1 eroen 2018-08-14 22:27:24 UTC
pine64-a ~ # emerge --info '=dev-libs/popt-1.16-r2::gentoo'
Portage 2.3.40 (python 3.6.5-final-0, default/linux/arm64/17.0, gcc-7.3.0, glibc-2.26-r7, 3.10.102-2-pine64-longsleep aarch64)
=================================================================
                         System Settings
=================================================================
System uname: Linux-3.10.102-2-pine64-longsleep-aarch64-with-gentoo-2.4.1
KiB Mem:     2036496 total,   1179304 free
KiB Swap:    2097148 total,   2026200 free
Timestamp of repository gentoo: Tue, 14 Aug 2018 09:00:01 +0000
Head commit of repository gentoo: 5594156a2725ad2551ec02185b2207dc24f70ac7
sh bash 4.4_p12
ld GNU ld (Gentoo 2.30 p2) 2.30.0
app-shells/bash:          4.4_p12::gentoo
dev-lang/perl:            5.24.3-r1::gentoo
dev-lang/python:          2.7.14-r1::gentoo, 3.6.5::gentoo
dev-util/cmake:           3.9.6::gentoo
dev-util/pkgconfig:       0.29.2::gentoo
sys-apps/baselayout:      2.4.1-r2::gentoo
sys-apps/openrc:          0.34.11::gentoo
sys-apps/sandbox:         2.13::gentoo
sys-devel/autoconf:       2.69-r4::gentoo
sys-devel/automake:       1.15.1-r2::gentoo
sys-devel/binutils:       2.30-r2::gentoo
sys-devel/gcc:            7.3.0-r3::gentoo
sys-devel/gcc-config:     1.8-r1::gentoo
sys-devel/libtool:        2.4.6-r3::gentoo
sys-devel/make:           4.2.1-r3::gentoo
sys-kernel/linux-headers: 4.13::gentoo (virtual/os-headers)
sys-libs/glibc:           2.26-r7::gentoo
Repositories:

gentoo
    location: /usr/portage
    sync-type: rsync
    sync-uri: rsync://rsync.gentoo.org/gentoo-portage
    priority: -1000
    sync-rsync-verify-metamanifest: yes
    sync-rsync-verify-jobs: 1
    sync-rsync-extra-opts: 
    sync-rsync-verify-max-age: 24

ACCEPT_KEYWORDS="arm64"
ACCEPT_LICENSE="* -@EULA"
CBUILD="aarch64-unknown-linux-gnu"
CFLAGS="-Os -g -pipe -mcpu=cortex-a53 -mfix-cortex-a53-843419"
CHOST="aarch64-unknown-linux-gnu"
CONFIG_PROTECT="/etc /usr/share/gnupg/qualified.txt"
CONFIG_PROTECT_MASK="/etc/ca-certificates.conf /etc/env.d /etc/gconf /etc/gentoo-release /etc/revdep-rebuild /etc/sandbox.d /etc/terminfo"
CXXFLAGS="-Os -g -pipe -mcpu=cortex-a53 -mfix-cortex-a53-843419"
DISTDIR="/usr/portage/distfiles"
ENV_UNSET="DBUS_SESSION_BUS_ADDRESS DISPLAY PERL5LIB PERL5OPT PERLPREFIX PERL_CORE PERL_MB_OPT PERL_MM_OPT XAUTHORITY XDG_CACHE_HOME XDG_CONFIG_HOME XDG_DATA_HOME XDG_RUNTIME_DIR"
FCFLAGS="-O2"
FEATURES="assume-digests binpkg-logs cgroup config-protect-if-modified distlocks ebuild-locks fixlafiles installsources ipc-sandbox merge-sync multilib-strict network-sandbox news parallel-fetch preserve-libs protect-owned sandbox sfperms splitdebug strict test unknown-features-warn unmerge-logs unmerge-orphans userfetch userpriv usersandbox usersync xattr"
FFLAGS="-O2"
GENTOO_MIRRORS="http://distfiles.gentoo.org"
LANG="en_GB.utf8"
LDFLAGS="-Wl,-O1 -Wl,--as-needed -mfix-cortex-a53-843419"
PKGDIR="/usr/portage/packages"
PORTAGE_CONFIGROOT="/"
PORTAGE_RSYNC_OPTS="--recursive --links --safe-links --perms --times --omit-dir-times --compress --force --whole-file --delete --stats --human-readable --timeout=180 --exclude=/distfiles --exclude=/local --exclude=/packages --exclude=/.git"
PORTAGE_TMPDIR="/var/tmp"
USE="acl arm64 berkdb bzip2 cli crypt cxx dri fortran gdbm iconv ipv6 libtirpc modules multilib ncurses nls nptl openmp pam pcre readline seccomp ssl tcpd unicode xattr zlib" APACHE2_MODULES="authn_core authz_core socache_shmcb unixd actions alias auth_basic authn_alias authn_anon authn_dbm authn_default authn_file authz_dbm authz_default authz_groupfile authz_host authz_owner authz_user autoindex cache cgi cgid dav dav_fs dav_lock deflate dir disk_cache env expires ext_filter file_cache filter headers include info log_config logio mem_cache mime mime_magic negotiation rewrite setenvif speling status unique_id userdir usertrack vhost_alias" CALLIGRA_FEATURES="karbon plan sheets stage words" COLLECTD_PLUGINS="df interface irq load memory rrdtool swap syslog" CPU_FLAGS_ARM="edsp neon thumb thumb2 v4 v5 v6 v7 v8 vfp vfp-d32 vfpv3 vfpv4" ELIBC="glibc" GPSD_PROTOCOLS="ashtech aivdm earthmate evermore fv18 garmin garmintxt gpsclock isync itrax mtk3301 nmea ntrip navcom oceanserver oldstyle oncore rtcm104v2 rtcm104v3 sirf skytraq superstar2 timing tsip tripmate tnt ublox ubx" INPUT_DEVICES="libinput keyboard mouse" KERNEL="linux" LCD_DEVICES="bayrad cfontz cfontz633 glk hd44780 lb216 lcdm001 mtxorb ncurses text" LIBREOFFICE_EXTENSIONS="presenter-console presenter-minimizer" OFFICE_IMPLEMENTATION="libreoffice" PHP_TARGETS="php5-6 php7-0" POSTGRES_TARGETS="postgres9_5 postgres10" PYTHON_SINGLE_TARGET="python3_6" PYTHON_TARGETS="python2_7 python3_6" RUBY_TARGETS="ruby21 ruby23" USERLAND="GNU" VIDEO_CARDS="fbdev dummy v4l" XTABLES_ADDONS="quota2 psd pknock lscan length2 ipv4options ipset ipp2p iface geoip fuzzy condition tee tarpit sysrq steal rawnat logmark ipmark dhcpmac delude chaos account"
Unset:  CC, CPPFLAGS, CTARGET, CXX, EMERGE_DEFAULT_OPTS, INSTALL_MASK, LC_ALL, LINGUAS, MAKEOPTS, PORTAGE_BINHOST, PORTAGE_BUNZIP2_COMMAND, PORTAGE_COMPRESS, PORTAGE_COMPRESS_FLAGS, PORTAGE_RSYNC_EXTRA_OPTS

=================================================================
                        Package Settings
=================================================================

dev-libs/popt-1.16-r2::gentoo was built with the following:
USE="nls -static-libs"

pine64-a ~ # emerge -pqv '=dev-libs/popt-1.16-r2::gentoo'
[ebuild   R   ] dev-libs/popt-1.16-r2  USE="nls -static-libs"