Gentoo Websites Logo
Go to: Gentoo Home Documentation Forums Lists Bugs Planet Store Wiki Get Gentoo!
Bug 662286 - x11-libs/c++-gtk-utils-2.2.16.1 : [TEST] FAIL: test_application
Summary: x11-libs/c++-gtk-utils-2.2.16.1 : [TEST] FAIL: test_application
Status: RESOLVED DUPLICATE of bug 423095
Alias: None
Product: Gentoo Linux
Classification: Unclassified
Component: Current packages (show other bugs)
Hardware: All Linux
: Normal normal
Assignee: Desktop Misc. Team
URL:
Whiteboard:
Keywords: TESTFAILURE
Depends on:
Blocks:
 
Reported: 2018-07-27 17:20 UTC by Toralf Förster
Modified: 2020-11-12 19:46 UTC (History)
1 user (show)

See Also:
Package list:
Runtime testing required: ---


Attachments
emerge-info.txt (emerge-info.txt,16.25 KB, text/plain)
2018-07-27 17:20 UTC, Toralf Förster
Details
emerge-history.txt (emerge-history.txt,73.72 KB, text/plain)
2018-07-27 17:20 UTC, Toralf Förster
Details
environment (environment,74.89 KB, text/plain)
2018-07-27 17:20 UTC, Toralf Förster
Details
etc.portage.tbz2 (etc.portage.tbz2,12.67 KB, application/x-bzip)
2018-07-27 17:20 UTC, Toralf Förster
Details
logs.tbz2 (logs.tbz2,10.40 KB, application/x-bzip)
2018-07-27 17:20 UTC, Toralf Förster
Details
temp.tbz2 (temp.tbz2,23.31 KB, application/x-bzip)
2018-07-27 17:20 UTC, Toralf Förster
Details
tests.tbz2 (tests.tbz2,348.79 KB, application/x-bzip)
2018-07-27 17:20 UTC, Toralf Förster
Details
x11-libs:c++-gtk-utils-2.2.16.1:20180727-135427.log (x11-libs:c++-gtk-utils-2.2.16.1:20180727-135427.log,190.95 KB, text/plain)
2018-07-27 17:20 UTC, Toralf Förster
Details

Note You need to log in before you can comment on or make changes to this bug.
Description Toralf Förster gentoo-dev 2018-07-27 17:20:25 UTC
(/var/tmp/portage/x11-libs/c++-gtk-utils-2.2.16.1/work/c++-gtk-utils-2.2.16.1/tests/.libs/test_application:3366): Gtk-WARNING **: cannot open display: 
FAIL: test_application
make[3]: *** [Makefile:1129: test-nonrecursive] Terminated
make[3]: Leaving directory '/var/tmp/portage/x11-libs/c++-gtk-utils-2.2.16.1/work/c++-gtk-utils-2.2.16.1/tests'
make[2]: *** [Makefile:946: check-am] Error 2

  -------------------------------------------------------------------

  This is an unstable amd64 chroot image at a tinderbox (==build bot)
  name: 17.0-desktop-plasma-systemd_libressl-test_20180725-194526

  -------------------------------------------------------------------

gcc-config -l:
 [1] x86_64-pc-linux-gnu-7.3.0 *

Available Python interpreters, in order of preference:
  [1]   python3.5
  [2]   python3.6 (fallback)
  [3]   python2.7 (fallback)

java-config:
The following VMs are available for generation-2:
*)	IcedTea JDK 3.8.0 [icedtea-bin-8]
Available Java Virtual Machines:
  [1]   icedtea-bin-8  system-vm

emerge -qpv x11-libs/c++-gtk-utils
[ebuild  N    ] x11-libs/c++-gtk-utils-2.2.16.1  USE="gtk nls -static-libs"
Comment 1 Toralf Förster gentoo-dev 2018-07-27 17:20:28 UTC
Created attachment 541322 [details]
emerge-info.txt
Comment 2 Toralf Förster gentoo-dev 2018-07-27 17:20:31 UTC
Created attachment 541324 [details]
emerge-history.txt
Comment 3 Toralf Förster gentoo-dev 2018-07-27 17:20:34 UTC
Created attachment 541326 [details]
environment
Comment 4 Toralf Förster gentoo-dev 2018-07-27 17:20:37 UTC
Created attachment 541328 [details]
etc.portage.tbz2
Comment 5 Toralf Förster gentoo-dev 2018-07-27 17:20:40 UTC
Created attachment 541330 [details]
logs.tbz2
Comment 6 Toralf Förster gentoo-dev 2018-07-27 17:20:43 UTC
Created attachment 541332 [details]
temp.tbz2
Comment 7 Toralf Förster gentoo-dev 2018-07-27 17:20:46 UTC
Created attachment 541334 [details]
tests.tbz2
Comment 8 Toralf Förster gentoo-dev 2018-07-27 17:20:49 UTC
Created attachment 541336 [details]
x11-libs:c++-gtk-utils-2.2.16.1:20180727-135427.log
Comment 9 Jonas Stein gentoo-dev 2020-11-12 19:46:45 UTC

*** This bug has been marked as a duplicate of bug 423095 ***