Gentoo Websites Logo
Go to: Gentoo Home Documentation Forums Lists Bugs Planet Store Wiki Get Gentoo!
Bug 659792 - dev-python/ws4py-0.5.1: test failure: test_mainloop_can_be_stopped_when_no_websocket_were_registered
Summary: dev-python/ws4py-0.5.1: test failure: test_mainloop_can_be_stopped_when_no_we...
Status: CONFIRMED
Alias: None
Product: Gentoo Linux
Classification: Unclassified
Component: Current packages (show other bugs)
Hardware: All Linux
: Normal normal (vote)
Assignee: Python Gentoo Team
URL:
Whiteboard:
Keywords: TESTFAILURE
Depends on:
Blocks:
 
Reported: 2018-07-01 21:54 UTC by Thomas Deutschmann
Modified: 2018-07-28 08:35 UTC (History)
0 users

See Also:
Package list:
Runtime testing required: ---


Attachments
build.log (build.log,8.81 KB, text/plain)
2018-07-01 21:54 UTC, Thomas Deutschmann
Details

Note You need to log in before you can comment on or make changes to this bug.
Description Thomas Deutschmann gentoo-dev Security 2018-07-01 21:54:31 UTC
Created attachment 538046 [details]
build.log

FAIL: test_mainloop_can_be_stopped_when_no_websocket_were_registered (test.test_manager.WSManagerTest)
----------------------------------------------------------------------
Traceback (most recent call last):
  File "/usr/lib/python2.7/site-packages/mock/mock.py", line 1305, in patched
    return func(*args, **keywargs)
  File "test/test_manager.py", line 72, in test_mainloop_can_be_stopped_when_no_websocket_were_registered
    self.assertTrue(m.running)
AssertionError: False is not true

----------------------------------------------------------------------
Ran 121 tests in 4.313s

FAILED (failures=1)
Exception in thread WebSocketManager (most likely raised during interpreter shutdown):
Traceback (most recent call last):
  File "/usr/lib/python2.7/threading.py", line 801, in __bootstrap_inner
  File "ws4py/manager.py", line 312, in run
  File "/usr/lib/python2.7/site-packages/mock/mock.py", line 1062, in __call__
  File "/usr/lib/python2.7/site-packages/mock/mock.py", line 1120, in _mock_call
<type 'exceptions.TypeError'>: 'NoneType' object is not callable
Unhandled exception in thread started by
sys.excepthook is missing
lost sys.stderr
 * ERROR: dev-python/ws4py-0.5.1::gentoo failed (test phase):
 *   Tests failed under python2.7
 *




Portage 2.3.40 (python 3.6.5-final-0, default/linux/x86/17.0, gcc-7.3.0, glibc-2.26-r7, 4.9.95-gentoo i686)
=================================================================
System uname: Linux-4.9.95-gentoo-i686-Intel-R-_Core-TM-_i7-3770K_CPU_@_3.50GHz-with-gentoo-2.4.1
KiB Mem:     3108308 total,   1934432 free
KiB Swap:     488276 total,    474896 free
Timestamp of repository gentoo: Sun, 01 Jul 2018 17:46:15 +0000
Head commit of repository gentoo: 8976c97207c582dcdc87e474f3d435fcb6929037

sh bash 4.4_p12
ld GNU ld (Gentoo 2.30 p2) 2.30.0
app-shells/bash:          4.4_p12::gentoo
dev-lang/perl:            5.24.3-r1::gentoo
dev-lang/python:          2.7.14-r1::gentoo, 3.6.5::gentoo
dev-util/cmake:           3.9.6::gentoo
dev-util/pkgconfig:       0.29.2::gentoo
sys-apps/baselayout:      2.4.1-r2::gentoo
sys-apps/openrc:          0.34.11::gentoo
sys-apps/sandbox:         2.13::gentoo
sys-devel/autoconf:       2.13::gentoo, 2.69-r4::gentoo
sys-devel/automake:       1.15.1-r2::gentoo
sys-devel/binutils:       2.30-r2::gentoo
sys-devel/gcc:            7.3.0-r3::gentoo
sys-devel/gcc-config:     1.8-r1::gentoo
sys-devel/libtool:        2.4.6-r3::gentoo
sys-devel/make:           4.2.1::gentoo
sys-kernel/linux-headers: 4.13::gentoo (virtual/os-headers)
sys-libs/glibc:           2.26-r7::gentoo
Repositories:

gentoo
    location: /usr/portage
    sync-type: git
    sync-uri: https://github.com/gentoo-mirror/gentoo.git
    priority: -1000

ABI="x86"
ABI_X86="32"
ACCEPT_KEYWORDS="x86"
ACCEPT_LICENSE="* -@EULA"
ACCEPT_PROPERTIES="*"
ACCEPT_RESTRICT="*"
ARCH="x86"
BROOT=""
CBUILD="i686-pc-linux-gnu"
CFLAGS="-O2 -pipe -march=pentium4m -mtune=pentium4m"
CHOST="i686-pc-linux-gnu"
CHOST_x86="i686-pc-linux-gnu"
COLLISION_IGNORE="/lib/modules/* *.py[co] *$py.class */dropin.cache"
CONFIG_PROTECT="/etc /usr/share/gnupg/qualified.txt"
CPU_FLAGS_X86="mmx mmxext sse sse2"
CXXFLAGS="-O2 -pipe -march=pentium4m -mtune=pentium4m"
DEFAULT_ABI="x86"
EDITOR="/usr/bin/mcedit"
ELIBC="glibc"
ENV_UNSET="DBUS_SESSION_BUS_ADDRESS DISPLAY PERL5LIB PERL5OPT PERLPREFIX PERL_CORE PERL_MB_OPT PERL_MM_OPT XAUTHORITY XDG_CACHE_HOME XDG_CONFIG_HOME XDG_DATA_HOME XDG_RUNTIME_DIR"
EPREFIX=""
EROOT="/"
ESYSROOT="/"
FCFLAGS="-O2 -march=i686 -pipe"
FEATURES="assume-digests binpkg-logs cgroup config-protect-if-modified distlocks downgrade-backup ebuild-locks fixlafiles merge-sync multilib-strict news parallel-fetch preserve-libs protect-owned sandbox sfperms strict unknown-features-warn unmerge-logs unmerge-orphans userfetch userpriv usersandbox usersync xattr"
FFLAGS="-O2 -march=i686 -pipe"
GCC_SPECS=""
GRUB_PLATFORMS="efi-32 pc"
GSETTINGS_BACKEND="dconf"
HOME="/root"
INFOPATH="/usr/share/gcc-data/i686-pc-linux-gnu/7.3.0/info:/usr/share/binutils-data/i686-pc-linux-gnu/2.30/info:/usr/share/info"
INPUT_DEVICES="libinput keyboard mouse"
IUSE_IMPLICIT="abi_x86_32 prefix prefix-chain prefix-guest"
KERNEL="linux"
L10N="en en-US de de-DE"
LANG="en_US.UTF-8"
LC_ALL="en_US.UTF-8"
LC_MESSAGES="C"
LC_PAPER="de_DE.UTF-8"
LDFLAGS="-Wl,-O1 -Wl,--as-needed"
LIBDIR_x86="lib"
LINGUAS="en de"
LOGNAME="root"
MAIL="/var/mail/root"
MAKEOPTS="--jobs 5 --load-average 7.95"
MULTILIB_ABIS="x86"
NOCOLOR="true"
OFFICE_IMPLEMENTATION="libreoffice"
OPENCL_PROFILE="mesa"
OPENGL_PROFILE="xorg-x11"
PAGER="/usr/bin/less"
PATH="/usr/i686-pc-linux-gnu/gcc-bin/7.3.0:/usr/lib/llvm/5/bin:/usr/local/sbin:/usr/local/bin:/usr/sbin:/usr/bin:/sbin:/bin:/opt/bin"
PHP_TARGETS="php5-6 php7-0"
POSTGRES_TARGETS="postgres9_5 postgres10"
PWD="/root"
PYTHONDONTWRITEBYTECODE="1"
PYTHON_SINGLE_TARGET="python3_6"
PYTHON_TARGETS="python2_7 python3_6"
QT_GRAPHICSSYSTEM="raster"
ROOT="/"
ROOTPATH="/usr/i686-pc-linux-gnu/gcc-bin/7.3.0:/usr/lib/llvm/5/bin:/usr/local/sbin:/usr/local/bin:/usr/sbin:/usr/bin:/sbin:/bin:/opt/bin"
RUBY_TARGETS="ruby22 ruby23"
SHELL="/bin/bash"
SHLVL="2"
SSH_TTY="/dev/pts/0"
SYSROOT="/"
TERM="tmux-256color"
TMUX="/tmp/tmux-0/default,6917,0"
TMUX_PANE="%3"
TWISTED_DISABLE_WRITING_OF_PLUGIN_CACHE="1"
USER="root"
USERLAND="GNU"
VIDEO_CARDS="vmware"
Comment 2 Thomas Deutschmann gentoo-dev Security 2018-07-28 08:35:37 UTC
Blocker removed, looks like a load/timing issue. Cannot reproduce at the moment when system load is zero.