Gentoo Websites Logo
Go to: Gentoo Home Documentation Forums Lists Bugs Planet Store Wiki Get Gentoo!
Bug 659110 - dev-python/bpython-0.17.1: multiple test failures
Summary: dev-python/bpython-0.17.1: multiple test failures
Status: CONFIRMED
Alias: None
Product: Gentoo Linux
Classification: Unclassified
Component: Current packages (show other bugs)
Hardware: All Linux
: Normal normal (vote)
Assignee: Andrey Grozin
URL:
Whiteboard:
Keywords: NeedPatch, TESTFAILURE
Depends on:
Blocks:
 
Reported: 2018-06-25 15:04 UTC by Thomas Deutschmann
Modified: 2018-06-28 19:03 UTC (History)
1 user (show)

See Also:
Package list:
Runtime testing required: ---


Attachments
build.log (build.log,29.13 KB, text/plain)
2018-06-25 15:04 UTC, Thomas Deutschmann
Details

Note You need to log in before you can comment on or make changes to this bug.
Description Thomas Deutschmann gentoo-dev Security 2018-06-25 15:04:45 UTC
Created attachment 537178 [details]
build.log

> >>> Test phase: dev-python/bpython-0.17.1
>  * python2_7: running distutils-r1_run_phase python_test
> ...................s..........................................s.............................s.......ss................................F.F...................................................................................E..............E..................ssss...ss......................................s....................
> ======================================================================
> ERROR: test_get_last_word_with_prev_line (bpython.test.test_curtsies_repl.TestCurtsiesRepl)
> ----------------------------------------------------------------------
> Traceback (most recent call last):
>   File "/usr/lib/python2.7/functools.py", line 33, in update_wrapper
>     setattr(wrapper, attr, getattr(wrapped, attr))
> AttributeError: 'TestCurtsiesRepl' object has no attribute '__name__'
> 
> ======================================================================
> ERROR: test_complex (bpython.test.test_curtsies_repl.TestPredictedIndent)
> ----------------------------------------------------------------------
> Traceback (most recent call last):
>   File "/usr/lib/python2.7/functools.py", line 33, in update_wrapper
>     setattr(wrapper, attr, getattr(wrapped, attr))
> AttributeError: 'TestPredictedIndent' object has no attribute '__name__'
> 
> ======================================================================
> FAIL: test_exec_dunder_file (bpython.test.test_args.TestExecArgs)
> ----------------------------------------------------------------------
> Traceback (most recent call last):
>   File "bpython/test/test_args.py", line 38, in test_exec_dunder_file
>     self.assertEquals(stderr.strip(), f.name)
> AssertionError: '' != '/var/tmp/portage/dev-python/bpython-0.17.1/temp/tmp_Nv4Bx'
> + /var/tmp/portage/dev-python/bpython-0.17.1/temp/tmp_Nv4Bx
> 
> ======================================================================
> FAIL: test_exec_nonascii_file_linenums (bpython.test.test_args.TestExecArgs)
> ----------------------------------------------------------------------
> Traceback (most recent call last):
>   File "bpython/test/test_args.py", line 70, in test_exec_nonascii_file_linenums
>     self.assertIn('line 3', clean_colors(stderr))
> AssertionError: 'line 3' not found in ''
> 
> ----------------------------------------------------------------------
> Ran 322 tests in 19.129s
> 
> FAILED (failures=2, errors=2, skipped=12)
> bpython version 0.17.1 on top of Python 2.7.14 /usr/bin/python2.7
> (C) 2008-2016 Bob Farrell, Andreas Stuehrk, Sebastian Ramacher, Thomas Ballinger, et al. See AUTHORS for detail.
> tmpQFkyt2
> tmp73JkDZ
>  * ERROR: dev-python/bpython-0.17.1::gentoo failed (test phase):
>  *   (no error message)


Portage 2.3.40 (python 3.6.5-final-0, default/linux/x86/17.0, gcc-7.3.0, glibc-2.26-r7, 4.9.95-gentoo i686)
=================================================================
System uname: Linux-4.9.95-gentoo-i686-Intel-R-_Core-TM-_i7-3770K_CPU_@_3.50GHz-with-gentoo-2.4.1
KiB Mem:     3108308 total,   1248084 free
KiB Swap:     488276 total,    487408 free
Timestamp of repository gentoo: Mon, 25 Jun 2018 10:26:13 +0000
Head commit of repository gentoo: deef60029d08b4fbfa0f90cfe1691dc6aadd213d

sh bash 4.4_p12
ld GNU ld (Gentoo 2.30 p2) 2.30.0
app-shells/bash:          4.4_p12::gentoo
dev-lang/perl:            5.24.3-r1::gentoo
dev-lang/python:          2.7.14-r1::gentoo, 3.5.5::gentoo, 3.6.5::gentoo
dev-util/cmake:           3.9.6::gentoo
dev-util/pkgconfig:       0.29.2::gentoo
sys-apps/baselayout:      2.4.1-r2::gentoo
sys-apps/openrc:          0.34.11::gentoo
sys-apps/sandbox:         2.13::gentoo
sys-devel/autoconf:       2.13::gentoo, 2.69-r4::gentoo
sys-devel/automake:       1.15.1-r2::gentoo
sys-devel/binutils:       2.30-r2::gentoo
sys-devel/gcc:            7.3.0-r3::gentoo
sys-devel/gcc-config:     1.8-r1::gentoo
sys-devel/libtool:        2.4.6-r3::gentoo
sys-devel/make:           4.2.1::gentoo
sys-kernel/linux-headers: 4.13::gentoo (virtual/os-headers)
sys-libs/glibc:           2.26-r7::gentoo
Repositories:

gentoo
    location: /usr/portage
    sync-type: git
    sync-uri: https://github.com/gentoo-mirror/gentoo.git
    priority: -1000

ABI="x86"
ABI_X86="32"
ACCEPT_KEYWORDS="x86"
ACCEPT_LICENSE="* -@EULA"
ACCEPT_PROPERTIES="*"
ACCEPT_RESTRICT="*"
ARCH="x86"
BROOT=""
CBUILD="i686-pc-linux-gnu"
CFLAGS="-O2 -pipe -march=pentium4m -mtune=pentium4m"
CHOST="i686-pc-linux-gnu"
CHOST_x86="i686-pc-linux-gnu"
COLLISION_IGNORE="/lib/modules/* *.py[co] *$py.class */dropin.cache"
CONFIG_PROTECT="/etc /usr/share/gnupg/qualified.txt"
CPU_FLAGS_X86="mmx mmxext sse sse2"
CXXFLAGS="-O2 -pipe -march=pentium4m -mtune=pentium4m"
DEFAULT_ABI="x86"
EDITOR="/usr/bin/mcedit"
ELIBC="glibc"
ENV_UNSET="DBUS_SESSION_BUS_ADDRESS DISPLAY PERL5LIB PERL5OPT PERLPREFIX PERL_CORE PERL_MB_OPT PERL_MM_OPT XAUTHORITY XDG_CACHE_HOME XDG_CONFIG_HOME XDG_DATA_HOME XDG_RUNTIME_DIR"
EPREFIX=""
EROOT="/"
ESYSROOT="/"
FCFLAGS="-O2 -march=i686 -pipe"
FEATURES="assume-digests binpkg-logs cgroup config-protect-if-modified distlocks downgrade-backup ebuild-locks fixlafiles merge-sync multilib-strict news parallel-fetch preserve-libs protect-owned sandbox sfperms strict unknown-features-warn unmerge-logs unmerge-orphans userfetch userpriv usersandbox usersync xattr"
FFLAGS="-O2 -march=i686 -pipe"
GCC_SPECS=""
GRUB_PLATFORMS="efi-32 pc"
GSETTINGS_BACKEND="dconf"
HOME="/root"
INFOPATH="/usr/share/gcc-data/i686-pc-linux-gnu/7.3.0/info:/usr/share/binutils-data/i686-pc-linux-gnu/2.30/info:/usr/share/info"
INPUT_DEVICES="libinput keyboard mouse"
IUSE_IMPLICIT="abi_x86_32 prefix prefix-chain prefix-guest"
KERNEL="linux"
L10N="en en-US de de-DE"
LANG="en_US.UTF-8"
LC_ALL="en_US.UTF-8"
LC_MESSAGES="C"
LC_PAPER="de_DE.UTF-8"
LDFLAGS="-Wl,-O1 -Wl,--as-needed"
LIBDIR_x86="lib"
LINGUAS="en de"
LOGNAME="root"
MAIL="/var/mail/root"
MAKEOPTS="--jobs 5 --load-average 7.95"
MULTILIB_ABIS="x86"
NOCOLOR="true"
OFFICE_IMPLEMENTATION="libreoffice"
OLDPWD="/root"
OPENCL_PROFILE="mesa"
OPENGL_PROFILE="xorg-x11"
PAGER="/usr/bin/less"
PATH="/usr/i686-pc-linux-gnu/gcc-bin/7.3.0:/usr/lib/llvm/5/bin:/usr/local/sbin:/usr/local/bin:/usr/sbin:/usr/bin:/sbin:/bin:/opt/bin"
PHP_TARGETS="php5-6 php7-0"
POSTGRES_TARGETS="postgres9_5 postgres10"
PWD="/tmp/stable"
PYTHONDONTWRITEBYTECODE="1"
PYTHON_SINGLE_TARGET="python3_6"
PYTHON_TARGETS="python2_7 python3_6"
QT_GRAPHICSSYSTEM="raster"
ROOT="/"
ROOTPATH="/usr/i686-pc-linux-gnu/gcc-bin/7.3.0:/usr/lib/llvm/5/bin:/usr/local/sbin:/usr/local/bin:/usr/sbin:/usr/bin:/sbin:/bin:/opt/bin"
RUBY_TARGETS="ruby22 ruby23"
SHELL="/bin/bash"
SHLVL="2"
SSH_TTY="/dev/pts/0"
SYSROOT="/"
TERM="tmux-256color"
TMUX="/tmp/tmux-0/default,4838,0"
TMUX_PANE="%4"
TWISTED_DISABLE_WRITING_OF_PLUGIN_CACHE="1"
USER="root"
USERLAND="GNU"
VIDEO_CARDS="vmware"
Comment 1 Pacho Ramos gentoo-dev 2018-06-28 08:45:15 UTC
In debian and Fedora they stopped running tests for this:
https://salsa.debian.org/sramacher/bpython/commit/9b31222ba3df58114992f5b51fa52311bd60f9fa
Comment 2 Pacho Ramos gentoo-dev 2018-06-28 19:03:54 UTC
[master 3a5399d34cb2] dev-python/bpython: Restrict tests (#659110)
 1 file changed, 2 insertions(+)