Gentoo Websites Logo
Go to: Gentoo Home Documentation Forums Lists Bugs Planet Store Wiki Get Gentoo!
Bug 656352 - dev-scheme/scm-5.5.6-r3 : [TEST] make: *** [Makefile:<snip>: check] Error 1
Summary: dev-scheme/scm-5.5.6-r3 : [TEST] make: *** [Makefile:<snip>: check] Error 1
Status: CONFIRMED
Alias: None
Product: Gentoo Linux
Classification: Unclassified
Component: Current packages (show other bugs)
Hardware: All Linux
: Normal normal (vote)
Assignee: Scheme Project
URL:
Whiteboard:
Keywords: TESTFAILURE
Depends on:
Blocks:
 
Reported: 2018-05-23 16:32 UTC by Toralf Förster
Modified: 2018-05-23 16:32 UTC (History)
0 users

See Also:
Package list:
Runtime testing required: ---


Attachments
emerge-info.txt (emerge-info.txt,16.23 KB, text/plain)
2018-05-23 16:32 UTC, Toralf Förster
Details
dev-scheme:scm-5.5.6-r3:20180523-095605.log (dev-scheme:scm-5.5.6-r3:20180523-095605.log,100.28 KB, text/plain)
2018-05-23 16:32 UTC, Toralf Förster
Details
emerge-history.txt (emerge-history.txt,128.41 KB, text/plain)
2018-05-23 16:32 UTC, Toralf Förster
Details
environment (environment,98.17 KB, text/plain)
2018-05-23 16:32 UTC, Toralf Förster
Details
etc.portage.tbz2 (etc.portage.tbz2,19.26 KB, application/x-bzip)
2018-05-23 16:32 UTC, Toralf Förster
Details
temp.tbz2 (temp.tbz2,35.39 KB, application/x-bzip)
2018-05-23 16:32 UTC, Toralf Förster
Details

Note You need to log in before you can comment on or make changes to this bug.
Description Toralf Förster gentoo-dev 2018-05-23 16:32:02 UTC
; program args: ("./scm" "-fr4rstest.scm" "-e(test-sc4)(test-cont)(test-delay)(gc)" "-e" "(or (null? errs) (quit 1))")
make: *** [Makefile:294: check] Error 1
 * ERROR: dev-scheme/scm-5.5.6-r3::gentoo failed (test phase):
 *   emake failed
 * 

  -------------------------------------------------------------------

  This is an unstable amd64 chroot image at a tinderbox (==build bot)
  name: 17.0-desktop-gnome-systemd_test_20180520-112305

  -------------------------------------------------------------------

gcc-config -l:
 [1] x86_64-pc-linux-gnu-7.3.0 *

Available Python interpreters, in order of preference:
  [1]   python3.5
  [2]   python2.7 (fallback)




emerge -qpv dev-scheme/scm
[ebuild  N    ] dev-scheme/scm-5.5.6-r3  USE="inexact ncurses readline -arrays -bignums -cautious -dynamic-linking -engineering-notation -gsubr -ioext -libscm -macro -posix -regex -sockets -unix"
Comment 1 Toralf Förster gentoo-dev 2018-05-23 16:32:05 UTC
Created attachment 532762 [details]
emerge-info.txt
Comment 2 Toralf Förster gentoo-dev 2018-05-23 16:32:08 UTC
Created attachment 532764 [details]
dev-scheme:scm-5.5.6-r3:20180523-095605.log
Comment 3 Toralf Förster gentoo-dev 2018-05-23 16:32:11 UTC
Created attachment 532766 [details]
emerge-history.txt
Comment 4 Toralf Förster gentoo-dev 2018-05-23 16:32:14 UTC
Created attachment 532768 [details]
environment
Comment 5 Toralf Förster gentoo-dev 2018-05-23 16:32:17 UTC
Created attachment 532770 [details]
etc.portage.tbz2
Comment 6 Toralf Förster gentoo-dev 2018-05-23 16:32:20 UTC
Created attachment 532772 [details]
temp.tbz2