Gentoo Websites Logo
Go to: Gentoo Home Documentation Forums Lists Bugs Planet Store Wiki Get Gentoo!
Bug 655034 - sys-libs/libcxx-6.0.0 : [TEST] FAILED: test/CMakeFiles/check-cxx
Summary: sys-libs/libcxx-6.0.0 : [TEST] FAILED: test/CMakeFiles/check-cxx
Status: CONFIRMED
Alias: None
Product: Gentoo Linux
Classification: Unclassified
Component: Current packages (show other bugs)
Hardware: All Linux
: Normal normal (vote)
Assignee: Alexis Ballier
URL:
Whiteboard:
Keywords: TESTFAILURE
Depends on:
Blocks:
 
Reported: 2018-05-06 08:18 UTC by Toralf Förster
Modified: 2018-05-06 08:19 UTC (History)
2 users (show)

See Also:
Package list:
Runtime testing required: ---


Attachments
emerge-info.txt (emerge-info.txt,15.11 KB, text/plain)
2018-05-06 08:18 UTC, Toralf Förster
Details
emerge-history.txt (emerge-history.txt,117.74 KB, text/plain)
2018-05-06 08:18 UTC, Toralf Förster
Details
environment (environment,171.62 KB, text/plain)
2018-05-06 08:18 UTC, Toralf Förster
Details
etc.portage.tbz2 (etc.portage.tbz2,12.49 KB, application/x-bzip)
2018-05-06 08:18 UTC, Toralf Förster
Details
logs.tbz2 (logs.tbz2,6.75 KB, application/x-bzip)
2018-05-06 08:18 UTC, Toralf Förster
Details
sys-libs:libcxx-6.0.0:20180505-190905.log (sys-libs:libcxx-6.0.0:20180505-190905.log,693.82 KB, text/plain)
2018-05-06 08:18 UTC, Toralf Förster
Details
temp.tbz2 (temp.tbz2,121.38 KB, application/x-bzip)
2018-05-06 08:18 UTC, Toralf Förster
Details

Note You need to log in before you can comment on or make changes to this bug.
Description Toralf Förster gentoo-dev 2018-05-06 08:18:29 UTC
  Unsupported Tests  : 127
  Unexpected Failures: 1
FAILED: test/CMakeFiles/check-cxx 
cd /var/tmp/portage/sys-libs/libcxx-6.0.0/work/libcxx-6.0.0.src-abi_x86_32.x86/test && /var/tmp/portage/sys-libs/libcxx-6.0.0/temp/python2.7/bin/python /usr/bin/lit -vv -j 1 --param=cxx_under_test=/usr/lib/llvm/6/bin/i686-pc-linux-gnu-clang /var/tmp/portage/sys-libs/libcxx-6.0.0/work/libcxx-6.0.0.src-abi_x86_32.x86/test
ninja: build stopped: subcommand failed.
 * ERROR: sys-libs/libcxx-6.0.0::gentoo failed (test phase):

  -------------------------------------------------------------------

  This is an unstable amd64 chroot image at a tinderbox (==build bot)
  name: 17.0-systemd_abi32+64-test_20180501-232814

  -------------------------------------------------------------------

gcc-config -l:
 [1] x86_64-pc-linux-gnu-7.3.0 *

Available Python interpreters, in order of preference:
  [1]   python3.5
  [2]   python2.7 (fallback)




emerge -qpv sys-libs/libcxx
[ebuild  N    ] sys-libs/libcxx-6.0.0  USE="libcxxabi libunwind static-libs {test} -libcxxrt" ABI_X86="32 (64) (-x32)"
Comment 1 Toralf Förster gentoo-dev 2018-05-06 08:18:33 UTC
Created attachment 530070 [details]
emerge-info.txt
Comment 2 Toralf Förster gentoo-dev 2018-05-06 08:18:37 UTC
Created attachment 530072 [details]
emerge-history.txt
Comment 3 Toralf Förster gentoo-dev 2018-05-06 08:18:40 UTC
Created attachment 530074 [details]
environment
Comment 4 Toralf Förster gentoo-dev 2018-05-06 08:18:44 UTC
Created attachment 530076 [details]
etc.portage.tbz2
Comment 5 Toralf Förster gentoo-dev 2018-05-06 08:18:47 UTC
Created attachment 530078 [details]
logs.tbz2
Comment 6 Toralf Förster gentoo-dev 2018-05-06 08:18:51 UTC
Created attachment 530080 [details]
sys-libs:libcxx-6.0.0:20180505-190905.log
Comment 7 Toralf Förster gentoo-dev 2018-05-06 08:18:55 UTC
Created attachment 530082 [details]
temp.tbz2