Gentoo Websites Logo
Go to: Gentoo Home Documentation Forums Lists Bugs Planet Store Wiki Get Gentoo!
Bug 651760 - dev-util/valgrind-3.13.0-r2 : [TEST] collect2: error: ld returned 1 exit status
Summary: dev-util/valgrind-3.13.0-r2 : [TEST] collect2: error: ld returned 1 exit status
Status: CONFIRMED
Alias: None
Product: Gentoo Linux
Classification: Unclassified
Component: Current packages (show other bugs)
Hardware: All Linux
: Normal normal (vote)
Assignee: Anthony Basile
URL:
Whiteboard:
Keywords: TESTFAILURE
Depends on:
Blocks:
 
Reported: 2018-03-27 17:28 UTC by Toralf Förster
Modified: 2018-12-01 10:52 UTC (History)
0 users

See Also:
Package list:
Runtime testing required: ---


Attachments
emerge-info.txt (emerge-info.txt,15.30 KB, text/plain)
2018-03-27 17:28 UTC, Toralf Förster
Details
dev-util:valgrind-3.13.0-r2:20180327-141953.log (dev-util:valgrind-3.13.0-r2:20180327-141953.log,640.48 KB, text/plain)
2018-03-27 17:28 UTC, Toralf Förster
Details
emerge-history.txt (emerge-history.txt,209.79 KB, text/plain)
2018-03-27 17:28 UTC, Toralf Förster
Details
environment (environment,101.77 KB, text/plain)
2018-03-27 17:28 UTC, Toralf Förster
Details
etc.portage.tbz2 (etc.portage.tbz2,13.13 KB, application/x-bzip)
2018-03-27 17:29 UTC, Toralf Förster
Details
logs.tbz2 (logs.tbz2,15.21 KB, application/x-bzip)
2018-03-27 17:29 UTC, Toralf Förster
Details
temp.tbz2 (temp.tbz2,44.54 KB, application/x-bzip)
2018-03-27 17:29 UTC, Toralf Förster
Details
tests.tbz2 (tests.tbz2,38.22 KB, application/x-bzip)
2018-03-27 17:29 UTC, Toralf Förster
Details

Note You need to log in before you can comment on or make changes to this bug.
Description Toralf Förster gentoo-dev 2018-03-27 17:28:47 UTC
/usr/lib/gcc/x86_64-pc-linux-gnu/5.4.0/../../../../x86_64-pc-linux-gnu/bin/ld: fxsave_amd64-fxsave-amd64.o: relocation R_X86_64_32S against symbol `vecZ' can not be used when making a PIE object; recompile with -fPIC
/usr/lib/gcc/x86_64-pc-linux-gnu/5.4.0/../../../../x86_64-pc-linux-gnu/bin/ld: final link failed: Nonrepresentable section on output
collect2: error: ld returned 1 exit status
make[5]: *** [Makefile:737: fxsave-amd64] Error 1
make[5]: Leaving directory '/var/tmp/portage/dev-util/valgrind-3.13.0-r2/work/valgrind-3.13.0/memcheck/tests/amd64'
make[4]: *** [Makefile:964: check-am] Error 2

  -------------------------------------------------------------------

  This is an unstable amd64 chroot image at a tinderbox (==build bot)
  name: 17.0-hardened_test_20180322-194027

  -------------------------------------------------------------------

gcc-config -l:
 [1] x86_64-pc-linux-gnu-5.4.0 *
 [2] x86_64-pc-linux-gnu-5.4.0-hardenednopie
 [3] x86_64-pc-linux-gnu-5.4.0-hardenednopiessp
 [4] x86_64-pc-linux-gnu-5.4.0-hardenednossp
 [5] x86_64-pc-linux-gnu-5.4.0-vanilla

Available Python interpreters, in order of preference:
  [1]   python3.5
  [2]   python3.6 (fallback)
  [3]   python2.7 (fallback)
  [4]   pypy3 (fallback)




emerge -qpv dev-util/valgrind
[ebuild  N    ] dev-util/valgrind-3.13.0-r2  USE="-mpi"
Comment 1 Toralf Förster gentoo-dev 2018-03-27 17:28:50 UTC
Created attachment 525780 [details]
emerge-info.txt
Comment 2 Toralf Förster gentoo-dev 2018-03-27 17:28:53 UTC
Created attachment 525782 [details]
dev-util:valgrind-3.13.0-r2:20180327-141953.log
Comment 3 Toralf Förster gentoo-dev 2018-03-27 17:28:56 UTC
Created attachment 525784 [details]
emerge-history.txt
Comment 4 Toralf Förster gentoo-dev 2018-03-27 17:28:59 UTC
Created attachment 525786 [details]
environment
Comment 5 Toralf Förster gentoo-dev 2018-03-27 17:29:02 UTC
Created attachment 525788 [details]
etc.portage.tbz2
Comment 6 Toralf Förster gentoo-dev 2018-03-27 17:29:05 UTC
Created attachment 525790 [details]
logs.tbz2
Comment 7 Toralf Förster gentoo-dev 2018-03-27 17:29:08 UTC
Created attachment 525792 [details]
temp.tbz2
Comment 8 Toralf Förster gentoo-dev 2018-03-27 17:29:11 UTC
Created attachment 525794 [details]
tests.tbz2
Comment 9 David Seifert gentoo-dev 2018-12-01 10:52:26 UTC
Not related to GCC 5