Gentoo Websites Logo
Go to: Gentoo Home Documentation Forums Lists Bugs Planet Store Wiki Get Gentoo!
Bug 643202 - dev-python/click-6.7 : [TEST] make: *** [Makefile:<snip>: test] Error 1
Summary: dev-python/click-6.7 : [TEST] make: *** [Makefile:<snip>: test] Error 1
Status: CONFIRMED
Alias: None
Product: Gentoo Linux
Classification: Unclassified
Component: Current packages (show other bugs)
Hardware: All Linux
: Normal normal (vote)
Assignee: Python Gentoo Team
URL:
Whiteboard:
Keywords: TESTFAILURE
Depends on:
Blocks:
 
Reported: 2018-01-03 00:13 UTC by Toralf Förster
Modified: 2020-07-13 14:21 UTC (History)
1 user (show)

See Also:
Package list:
Runtime testing required: ---


Attachments
emerge-info.txt (emerge-info.txt,16.40 KB, text/plain)
2018-01-03 00:13 UTC, Toralf Förster
Details
dev-python:click-6.7:20180102-225057.log (dev-python:click-6.7:20180102-225057.log,8.07 KB, text/plain)
2018-01-03 00:13 UTC, Toralf Förster
Details
emerge-history.txt (emerge-history.txt,131.90 KB, text/plain)
2018-01-03 00:13 UTC, Toralf Förster
Details
environment (environment,108.61 KB, text/plain)
2018-01-03 00:13 UTC, Toralf Förster
Details
etc.portage.tbz2 (etc.portage.tbz2,17.04 KB, application/x-bzip)
2018-01-03 00:14 UTC, Toralf Förster
Details
temp.tbz2 (temp.tbz2,25.76 KB, application/x-bzip)
2018-01-03 00:14 UTC, Toralf Förster
Details
tests.tbz2 (tests.tbz2,12.00 KB, application/x-bzip)
2018-01-03 00:14 UTC, Toralf Förster
Details

Note You need to log in before you can comment on or make changes to this bug.
Description Toralf Förster gentoo-dev 2018-01-03 00:13:45 UTC
    "Plugin %r could not be loaded: %s!" % (ep.name, e))
_pytest.vendored_packages.pluggy.PluginValidationError: Plugin 'case' could not be loaded: (mock 1.3.0 (/usr/lib64/python2.7/site-packages), Requirement.parse('mock>=2.0'))!
make: *** [Makefile:2: test] Error 1
 * ERROR: dev-python/click-6.7::gentoo failed (test phase):
 *   emake failed
 * 

  -------------------------------------------------------------------

  This is an unstable amd64 chroot image at a tinderbox (==build bot)
  name: 17.0-no-multilib-hardened_libressl-test_20171229-182601

  -------------------------------------------------------------------

gcc-config -l:
 [1] x86_64-pc-linux-gnu-7.2.0 *

Available Python interpreters, in order of preference:
  [1]   python3.5
  [2]   python2.7 (fallback)

java-config:
The following VMs are available for generation-2:
*)	IcedTea JDK 3.6.0 [icedtea-bin-8]
Available Java Virtual Machines:
  [1]   icedtea-bin-8  system-vm

emerge -qpv dev-python/click
[ebuild  N    ] dev-python/click-6.7  USE="-doc -examples {-test}" PYTHON_TARGETS="python2_7 python3_5 -pypy -pypy3 -python3_4 -python3_6"
Comment 1 Toralf Förster gentoo-dev 2018-01-03 00:13:48 UTC
Created attachment 512942 [details]
emerge-info.txt
Comment 2 Toralf Förster gentoo-dev 2018-01-03 00:13:51 UTC
Created attachment 512944 [details]
dev-python:click-6.7:20180102-225057.log
Comment 3 Toralf Förster gentoo-dev 2018-01-03 00:13:54 UTC
Created attachment 512946 [details]
emerge-history.txt
Comment 4 Toralf Förster gentoo-dev 2018-01-03 00:13:57 UTC
Created attachment 512948 [details]
environment
Comment 5 Toralf Förster gentoo-dev 2018-01-03 00:14:00 UTC
Created attachment 512950 [details]
etc.portage.tbz2
Comment 6 Toralf Förster gentoo-dev 2018-01-03 00:14:03 UTC
Created attachment 512952 [details]
temp.tbz2
Comment 7 Toralf Förster gentoo-dev 2018-01-03 00:14:06 UTC
Created attachment 512954 [details]
tests.tbz2