Gentoo Websites Logo
Go to: Gentoo Home Documentation Forums Lists Bugs Planet Store Wiki Get Gentoo!
Bug 639986 - media-libs/gegl-0.2.0-r2 - src_test(): buffer-test.o: undefined reference to symbol 'floor@@GLIBC_2.0'
Summary: media-libs/gegl-0.2.0-r2 - src_test(): buffer-test.o: undefined reference to ...
Status: CONFIRMED
Alias: None
Product: Gentoo Linux
Classification: Unclassified
Component: Current packages (show other bugs)
Hardware: PPC Linux
: Normal normal (vote)
Assignee: Sebastian Pipping
URL:
Whiteboard:
Keywords: TESTFAILURE
Depends on:
Blocks:
 
Reported: 2017-12-05 22:04 UTC by ernsteiswuerfel
Modified: 2018-02-18 21:10 UTC (History)
2 users (show)

See Also:
Package list:
Runtime testing required: ---


Attachments
emerge --info (file_639986.txt,6.11 KB, text/plain)
2017-12-05 22:04 UTC, ernsteiswuerfel
Details
build.log (gegl_build.log,514.20 KB, text/plain)
2017-12-05 22:05 UTC, ernsteiswuerfel
Details
emerge --info (file_639986.txt,5.68 KB, text/plain)
2018-01-21 20:25 UTC, ernsteiswuerfel
Details
build.log (media-libs/gegl-0.2.0-r5) (build.log,455.93 KB, text/plain)
2018-01-21 20:26 UTC, ernsteiswuerfel
Details

Note You need to log in before you can comment on or make changes to this bug.
Description ernsteiswuerfel 2017-12-05 22:04:39 UTC
Created attachment 508442 [details]
emerge --info

/usr/lib/gcc/powerpc-unknown-linux-gnu/6.4.0/../../../../powerpc-unknown-linux-gnu/bin/ld: buffer-test.o: undefined reference to symbol 'floor@@GLIBC_2.0'
/lib/libm.so.6: error adding symbols: DSO missing from command line
collect2: error: ld returned 1 exit status
make[5]: *** [Makefile:484: buffer-test] Error 1
make[5]: Leaving directory '/var/tmp/portage/media-libs/gegl-0.2.0-r2/work/gegl-0.2.0/tests/buffer'
make[4]: *** [Makefile:805: check-am] Error 2
make[4]: Leaving directory '/var/tmp/portage/media-libs/gegl-0.2.0-r2/work/gegl-0.2.0/tests/buffer'
make[3]: *** [Makefile:528: check-recursive] Error 1
make[3]: Leaving directory '/var/tmp/portage/media-libs/gegl-0.2.0-r2/work/gegl-0.2.0/tests/buffer'
make[2]: *** [Makefile:808: check] Error 2
make[2]: Leaving directory '/var/tmp/portage/media-libs/gegl-0.2.0-r2/work/gegl-0.2.0/tests/buffer'
make[1]: *** [Makefile:426: check-recursive] Error 1
make[1]: Leaving directory '/var/tmp/portage/media-libs/gegl-0.2.0-r2/work/gegl-0.2.0/tests'
make: *** [Makefile:544: check-recursive] Error 1
 * ERROR: media-libs/gegl-0.2.0-r2::gentoo failed (test phase):
Comment 1 ernsteiswuerfel 2017-12-05 22:05:57 UTC
Created attachment 508444 [details]
build.log
Comment 2 ernsteiswuerfel 2018-01-21 20:25:17 UTC
media-libs/gegl-0.2.0-r5 also affected.
Comment 3 ernsteiswuerfel 2018-01-21 20:25:48 UTC
Created attachment 515758 [details]
emerge --info
Comment 4 ernsteiswuerfel 2018-01-21 20:26:55 UTC
Created attachment 515760 [details]
build.log (media-libs/gegl-0.2.0-r5)
Comment 5 Sergei Trofimovich gentoo-dev 2018-02-18 21:10:38 UTC
Same happens on ia64 when building tests:

libtool: link: ia64-unknown-linux-gnu-gcc -pthread -I/usr/include/glib-2.0 -I/usr/lib/glib-2.0/include -I/usr/include/babl-0.1 -O2 -pipe -fdiagnostics-show-option -frecord-gcc-switches -Wall
-Wdeclaration-after-statement -Wmissing-prototypes -Wmissing-declarations -Winit-self -Wpointer-arith -Wold-style-definition -DG_LOG_DOMAIN=\"GEGL-\"__FILE__ -Wl,-O1 -Wl,--hash-style=gnu -o .
libs/buffer-test buffer-test.o -Wl,--export-dynamic -pthread -pthread  ../../gegl/.libs/libgegl-0.2.so -lgmodule-2.0 -lgio-2.0 -lgobject-2.0 -lgthread-2.0 -lglib-2.0 -lbabl-0.1 -pthread
/usr/lib/gcc/ia64-unknown-linux-gnu/6.4.0/../../../../ia64-unknown-linux-gnu/bin/ld: buffer-test.o: undefined reference to symbol 'floor@@GLIBC_2.2'
/lib/libm.so.6.1: error adding symbols: DSO missing from command line
collect2: error: ld returned 1 exit status