Gentoo Websites Logo
Go to: Gentoo Home Documentation Forums Lists Bugs Planet Store Wiki Get Gentoo!
Bug 638308 - sys-devel/bison-3.0.4-r1 fails tests 430, 431, 432 with gcc-7.2.0
Summary: sys-devel/bison-3.0.4-r1 fails tests 430, 431, 432 with gcc-7.2.0
Status: RESOLVED FIXED
Alias: None
Product: Gentoo Linux
Classification: Unclassified
Component: Current packages (show other bugs)
Hardware: All Linux
: Normal normal (vote)
Assignee: Gentoo's Team for Core System packages
URL: https://lists.gnu.org/archive/html/bu...
Whiteboard:
Keywords: TESTFAILURE
Depends on:
Blocks:
 
Reported: 2017-11-21 11:46 UTC by Paolo Pedroni
Modified: 2017-11-21 18:40 UTC (History)
1 user (show)

See Also:
Package list:
Runtime testing required: ---


Attachments
testsuite.log (testsuite.log,870.28 KB, text/x-log)
2017-11-21 11:46 UTC, Paolo Pedroni
Details
bison-3.0.4-r1:20171121-110917.log.gz (bison-3.0.4-r1:20171121-110917.log.gz,43.26 KB, application/gzip)
2017-11-21 11:48 UTC, Paolo Pedroni
Details

Note You need to log in before you can comment on or make changes to this bug.
Description Paolo Pedroni 2017-11-21 11:46:20 UTC
Created attachment 505262 [details]
testsuite.log

430: Variants lalr1.cc parse.assert api.token.constructor FAILED (c++.at:374)
431: Variants lalr1.cc parse.assert api.token.constructor api.token.prefix={TOK_} FAILED (c++.at:375)
432: Variants lalr1.cc parse.assert api.token.constructor api.token.prefix={TOK_} %locations FAILED (c++.at:376)
[...SKIP...]
## ------------- ##
## Test results. ##
## ------------- ##

ERROR: 484 tests were run,
3 failed unexpectedly.
9 tests were skipped.
## -------------------------- ##
## testsuite.log was created. ##
## -------------------------- ##

Please send `tests/testsuite.log' and all information you think might help:

   To: <bug-bison@gnu.org>
   Subject: [GNU Bison 3.0.4] testsuite: 430 431 432 failed

You may investigate any problem if you feel able to do so, in which
case the test suite provides a good starting point.  Its output may
be found below `tests/testsuite.dir'.

make[3]: *** [Makefile:6856: check-local] Error 1
make[3]: Leaving directory '/var/tmp/portage/sys-devel/bison-3.0.4-r1/work/bison-3.0.4'
make[2]: *** [Makefile:4987: check-am] Error 2
make[2]: Leaving directory '/var/tmp/portage/sys-devel/bison-3.0.4-r1/work/bison-3.0.4'
make[1]: *** [Makefile:4534: check-recursive] Error 1
make[1]: Leaving directory '/var/tmp/portage/sys-devel/bison-3.0.4-r1/work/bison-3.0.4'
make: *** [Makefile:4989: check] Error 2
 * ERROR: sys-devel/bison-3.0.4-r1::gentoo failed (test phase):
 *   Make check failed. See above for details.

It all worked fine with gcc-6.4.0...

testsuite.log is attached, as well as the complete build log.

# emerge --info =sys-devel/bison-3.0.4-r1
Portage 2.3.13 (python 3.5.4-final-0, default/linux/amd64/13.0/desktop/plasma/systemd, gcc-7.2.0, glibc-2.25-r9, 4.12.12-gentoo x86_64)
=================================================================
                         System Settings
=================================================================
System uname: Linux-4.12.12-gentoo-x86_64-Intel-R-_Core-TM-_i7-2600_CPU_@_3.40GHz-with-gentoo-2.4.1
KiB Mem:    15864960 total,   7107668 free
KiB Swap:    8171516 total,   8013792 free
Timestamp of repository gentoo: Mon, 20 Nov 2017 07:45:01 +0000
Head commit of repository gentoo: 771285a9b67a87ff1c83833027aca305680700e0
sh dash 0.5.9.1-r3
ld GNU gold (Gentoo 2.28.1 p1.0 2.28.1) 1.14
distcc 3.2rc1 x86_64-pc-linux-gnu [enabled]
ccache version 3.3.4 [disabled]
app-shells/bash:          4.3_p48-r1::gentoo
dev-java/java-config:     2.2.0-r3::gentoo
dev-lang/perl:            5.26.1-r1::gentoo
dev-lang/python:          2.7.14::gentoo, 3.5.4::gentoo
dev-util/ccache:          3.3.4-r1::gentoo
dev-util/cmake:           3.8.2::gentoo
dev-util/pkgconfig:       0.29.2::gentoo
sys-apps/baselayout:      2.4.1-r2::gentoo
sys-apps/sandbox:         2.10-r4::gentoo
sys-devel/autoconf:       2.13::gentoo, 2.69::gentoo
sys-devel/automake:       1.15-r2::gentoo
sys-devel/binutils:       2.28.1::gentoo
sys-devel/gcc:            6.4.0::gentoo, 7.2.0::gentoo
sys-devel/gcc-config:     1.8-r1::gentoo
sys-devel/libtool:        2.4.6-r3::gentoo
sys-devel/make:           4.2.1::gentoo
sys-kernel/linux-headers: 4.10::gentoo (virtual/os-headers)
sys-libs/glibc:           2.25-r9::gentoo
Repositories:

gentoo
    location: /usr/portage
    sync-type: rsync
    sync-uri: rsync://rsync.europe.gentoo.org/gentoo-portage
    priority: -1000
    sync-rsync-extra-opts: 

x-portage
    location: /usr/local/portage
    masters: gentoo
    priority: 0

ACCEPT_KEYWORDS="amd64"
ACCEPT_LICENSE="* -@EULA"
CBUILD="x86_64-pc-linux-gnu"
CFLAGS="-O2 -pipe -march=sandybridge -msahf --param l1-cache-size=32 --param l1-cache-line-size=64 --param l2-cache-size=8192 -flto=8 -fuse-linker-plugin"
CHOST="x86_64-pc-linux-gnu"
CONFIG_PROTECT="/etc /usr/lib64/libreoffice/program/sofficerc /usr/share/config /usr/share/gnupg/qualified.txt"
CONFIG_PROTECT_MASK="/etc/ca-certificates.conf /etc/dconf /etc/env.d /etc/fonts/fonts.conf /etc/gconf /etc/gentoo-release /etc/php/apache2-php7.0/ext-active/ /etc/php/cgi-php7.0/ext-active/ /etc/php/cli-php7.0/ext-active/ /etc/revdep-rebuild /etc/sandbox.d /etc/terminfo"
CXXFLAGS="-O2 -pipe -march=sandybridge -msahf --param l1-cache-size=32 --param l1-cache-line-size=64 --param l2-cache-size=8192 -flto=8 -fuse-linker-plugin"
DISTDIR="/usr/portage/distfiles"
EMERGE_DEFAULT_OPTS="--keep-going y --with-bdeps y"
FCFLAGS="-O2 -pipe"
FEATURES="assume-digests binpkg-logs cgroup compress-build-logs config-protect-if-modified distcc distlocks ebuild-locks ipc-sandbox merge-sync multilib-strict news parallel-fetch protect-owned sandbox sfperms split-elog split-log strict test unknown-features-warn unmerge-logs unmerge-orphans userfetch userpriv usersandbox usersync xattr"
FFLAGS="-O2 -pipe"
GENTOO_MIRRORS="http://tux.rainside.sk/gentoo/ http://mirror.leaseweb.com/gentoo/ http://ftp.uni-erlangen.de/pub/mirrors/gentoo http://ftp.spline.inf.fu-berlin.de/mirrors/gentoo/"
LANG="it_IT.UTF-8"
LDFLAGS="-Wl,-O1 -Wl,--as-needed -Wl,--hash-style=gnu -Wl,--sort-common -flto=8 -fuse-linker-plugin"
MAKEOPTS="-j11 -l8"
PKGDIR="/usr/portage/packages"
PORTAGE_CONFIGROOT="/"
PORTAGE_RSYNC_OPTS="--recursive --links --safe-links --perms --times --omit-dir-times --compress --force --whole-file --delete --stats --human-readable --timeout=180 --exclude=/distfiles --exclude=/local --exclude=/packages --exclude=/.git"
PORTAGE_TMPDIR="/var/tmp"
USE="X a52 aac aalib acl acpi activities adns alsa amd64 ao audiofile bash-completion bluetooth branding bzip2 cairo caps cdda cddb cdparanoia cdr cli cracklib crypt css cups curl cxx dbus declarative dga djvu dri dts dvd dvdr emboss encode exif expat fbcon ffmpeg fftw firefox flac fontconfig foomaticdb fortran ftp gd gdbm geoip gif gimp glamor gmp gnutls gphoto2 gpm graphviz gtk handbook iconv icu idn imagemagick imlib ipv6 java javascript jbig jpeg jpeg2k kde kipi kwallet lame lcms libass libcaca libnotify libsamplerate lm_sensors lua lzma lzo mad mmap mng modules mp3 mp4 mpeg mplayer multilib musicbrainz ncurses nls nptl nsplugin offensive ogg openal openexr opengl openmp pam pango pcre pdf phonon plasma png policykit postscript ppds pulseaudio qml qt3support qt4 qt5 rdesktop readline recode samba sctp sdl seccomp session sndfile sockets speex spell sqlite ssl startup-notification subversion svg symlink syslog systemd sysvipc taglib theora threads tidy tiff truetype udev udisks unicode upower usb vaapi vcd vim-syntax vnc vorbis wayland widgets win32codecs wmf wxwidgets x264 xattr xcb xcomposite xine xinerama xml xpm xscreensaver xv xvid yahoo zlib" ABI_X86="64" ALSA_CARDS="hda-intel virmidi" APACHE2_MODULES="authn_core authz_core socache_shmcb unixd actions alias auth_basic authn_alias authn_anon authn_dbm authn_default authn_file authz_dbm authz_default authz_groupfile authz_host authz_owner authz_user autoindex cache cgi cgid dav dav_fs dav_lock deflate dir disk_cache env expires ext_filter file_cache filter headers include info log_config logio mem_cache mime mime_magic negotiation rewrite setenvif speling status unique_id userdir usertrack vhost_alias" CALLIGRA_FEATURES="kexi words flow plan sheets stage tables krita karbon braindump author" CAMERAS="kodak ptp2" COLLECTD_PLUGINS="df interface irq load memory rrdtool swap syslog" CPU_FLAGS_X86="aes avx mmx mmxext popcnt sse sse2 sse3 sse4_1 sse4_2 ssse3" CURL_SSL="gnutls" ELIBC="glibc" GPSD_PROTOCOLS="ashtech aivdm earthmate evermore fv18 garmin garmintxt gpsclock isync itrax mtk3301 nmea ntrip navcom oceanserver oldstyle oncore rtcm104v2 rtcm104v3 sirf skytraq superstar2 timing tsip tripmate tnt ublox ubx" GRUB_PLATFORMS="pc" INPUT_DEVICES="libinput" KERNEL="linux" L10N="it en" LCD_DEVICES="bayrad cfontz cfontz633 glk hd44780 lb216 lcdm001 mtxorb ncurses text" LIBREOFFICE_EXTENSIONS="nlpsolver" LINGUAS="it it_IT" OFFICE_IMPLEMENTATION="libreoffice" PHP_TARGETS="php5-6 php7-0" POSTGRES_TARGETS="postgres9_5" PYTHON_TARGETS="python2_7 python3_5 pypy pypy3" RUBY_TARGETS="ruby22" USERLAND="GNU" VIDEO_CARDS="intel i965" XTABLES_ADDONS="quota2 psd pknock lscan length2 ipv4options ipset ipp2p iface geoip fuzzy condition tee tarpit sysrq steal rawnat logmark ipmark dhcpmac delude chaos account"
Unset:  CC, CPPFLAGS, CTARGET, CXX, INSTALL_MASK, LC_ALL, PORTAGE_BUNZIP2_COMMAND, PORTAGE_COMPRESS, PORTAGE_COMPRESS_FLAGS, PORTAGE_RSYNC_EXTRA_OPTS

=================================================================
                        Package Settings
=================================================================

sys-devel/bison-3.0.4-r1::gentoo was built with the following:
USE="nls test -examples -static" ABI_X86="(64)"

# emerge -1pqv =sys-devel/bison-3.0.4-r1
[ebuild   R   ] sys-devel/bison-3.0.4-r1  USE="nls {test} -examples -static"
Comment 1 Paolo Pedroni 2017-11-21 11:48:13 UTC
Created attachment 505264 [details]
bison-3.0.4-r1:20171121-110917.log.gz
Comment 2 Paolo Pedroni 2017-11-21 11:49:23 UTC
There is a bug report on this same issue (with no activity whatsoever) on the bug-bison ML at <https://lists.gnu.org/archive/html/bug-bison/2017-09/msg00000.html>
Comment 3 Thomas Deutschmann gentoo-dev Security 2017-11-21 18:38:58 UTC
Affects test suite only.
Comment 4 Larry the Git Cow gentoo-dev 2017-11-21 18:40:27 UTC
The bug has been closed via the following commit(s):

https://gitweb.gentoo.org/repo/gentoo.git/commit/?id=c284480b5e7e390aa76810e158eeae5b5c4beb54

commit c284480b5e7e390aa76810e158eeae5b5c4beb54
Author:     Thomas Deutschmann <whissi@gentoo.org>
AuthorDate: 2017-11-21 18:40:00 +0000
Commit:     Thomas Deutschmann <whissi@gentoo.org>
CommitDate: 2017-11-21 18:40:14 +0000

    sys-devel/bison: Fix test suite when using GCC 7
    
    Closes: https://bugs.gentoo.org/638308
    Package-Manager: Portage-2.3.13, Repoman-2.3.4

 sys-devel/bison/bison-3.0.4-r1.ebuild              |   1 +
 .../bison/files/bison-3.0.4-fix-tests-gcc-7.patch  | 151 +++++++++++++++++++++
 2 files changed, 152 insertions(+)