Gentoo Websites Logo
Go to: Gentoo Home Documentation Forums Lists Bugs Planet Store Wiki Get Gentoo!
Bug 638222 - dev-libs/libatomic_ops-7.6.0 fails to compile tests with gcc-7.2.0
Summary: dev-libs/libatomic_ops-7.6.0 fails to compile tests with gcc-7.2.0
Alias: None
Product: Gentoo Linux
Classification: Unclassified
Component: Current packages (show other bugs)
Hardware: All Linux
: Normal normal (vote)
Assignee: Gentoo Sound Team
: 641410 (view as bug list)
Depends on:
Blocks: gcc-7
  Show dependency tree
Reported: 2017-11-20 15:27 UTC by Paolo Pedroni
Modified: 2018-04-04 21:16 UTC (History)
4 users (show)

See Also:
Package list:
Runtime testing required: ---

libatomic_ops-7.6.0:20171120-135559.log.gz (libatomic_ops-7.6.0:20171120-135559.log.gz,8.07 KB, application/gzip)
2017-11-20 15:27 UTC, Paolo Pedroni

Note You need to log in before you can comment on or make changes to this bug.
Description Paolo Pedroni 2017-11-20 15:27:41 UTC
Created attachment 505070 [details]

/bin/bash ../libtool  --tag=CC   --mode=link x86_64-pc-linux-gnu-gcc  -Wall -Wextra -Wpedantic -Wno-long-long -O2 -pipe -march=sandybridge -msahf --param l1-cache-size=32 --param l1-cache-line-size=64 --param l2-cache-size=8192 -flto=8 -fuse-linker-plugin   -Wl,-O1 -Wl,--as-needed -Wl,--hash-style=gnu -Wl,--sort-common -flto=8 -fuse-linker-plugin -o test_malloc test_malloc.o -lpthread ../src/ ../src/ 
libtool: link: x86_64-pc-linux-gnu-gcc -Wall -Wextra -Wpedantic -Wno-long-long -O2 -pipe -march=sandybridge -msahf --param l1-cache-size=32 --param l1-cache-line-size=64 --param l2-cache-size=8192 -flto=8 -fuse-linker-plugin -Wl,-O1 -Wl,--as-needed -Wl,--hash-style=gnu -Wl,--sort-common -flto=8 -fuse-linker-plugin -o test_stack test_stack.o  -lpthread ../src/.libs/libatomic_ops_gpl.a /var/tmp/portage/dev-libs/libatomic_ops-7.6.0/work/libatomic_ops-7.6.0-abi_x86_64.amd64/src/.libs/libatomic_ops.a ../src/.libs/libatomic_ops.a
libtool: link: x86_64-pc-linux-gnu-gcc -Wall -Wextra -Wpedantic -Wno-long-long -O2 -pipe -march=sandybridge -msahf --param l1-cache-size=32 --param l1-cache-line-size=64 --param l2-cache-size=8192 -flto=8 -fuse-linker-plugin -Wl,-O1 -Wl,--as-needed -Wl,--hash-style=gnu -Wl,--sort-common -flto=8 -fuse-linker-plugin -o test_malloc test_malloc.o  -lpthread ../src/.libs/libatomic_ops_gpl.a /var/tmp/portage/dev-libs/libatomic_ops-7.6.0/work/libatomic_ops-7.6.0-abi_x86_64.amd64/src/.libs/libatomic_ops.a ../src/.libs/libatomic_ops.a
/bin/bash ../libtool  --tag=CC   --mode=link x86_64-pc-linux-gnu-gcc  -Wall -Wextra -Wpedantic -Wno-long-long -O2 -pipe -march=sandybridge -msahf --param l1-cache-size=32 --param l1-cache-line-size=64 --param l2-cache-size=8192 -flto=8 -fuse-linker-plugin   -Wl,-O1 -Wl,--as-needed -Wl,--hash-style=gnu -Wl,--sort-common -flto=8 -fuse-linker-plugin -o test_atomic test_atomic.o -lpthread ../src/ 
/bin/bash ../libtool  --tag=CC   --mode=link x86_64-pc-linux-gnu-gcc  -Wall -Wextra -Wpedantic -Wno-long-long -O2 -pipe -march=sandybridge -msahf --param l1-cache-size=32 --param l1-cache-line-size=64 --param l2-cache-size=8192 -flto=8 -fuse-linker-plugin   -Wl,-O1 -Wl,--as-needed -Wl,--hash-style=gnu -Wl,--sort-common -flto=8 -fuse-linker-plugin -o test_atomic_pthreads test_atomic_pthreads-test_atomic.o -lpthread ../src/ 
/var/tmp/portage/dev-libs/libatomic_ops-7.6.0/temp/ccqznyo7.ltrans0.ltrans.o:<artificial>:function AO_stack_pop_acquire.constprop.0: error: undefined reference to '__atomic_compare_exchange_16'
collect2: error: ld returned 1 exit status
distcc[9439] ERROR: compile (null) on localhost failed
make[3]: *** [Makefile:638: test_stack] Error 1
make[3]: *** Waiting for unfinished jobs....
/var/tmp/portage/dev-libs/libatomic_ops-7.6.0/temp/cc7RUsk7.ltrans0.ltrans.o:<artificial>:function AO_stack_pop_acquire: error: undefined reference to '__atomic_compare_exchange_16'
collect2: error: ld returned 1 exit status
distcc[9444] ERROR: compile (null) on localhost failed
make[3]: *** [Makefile:634: test_malloc] Error 1
 * ERROR: dev-libs/libatomic_ops-7.6.0::gentoo failed (test phase):
 *   Make check failed. See above for details.
 * Call stack:
 *  , line  124:  Called src_test
 *          environment, line 1468:  Called multilib-minimal_src_test
 *          environment, line  995:  Called multilib_foreach_abi 'multilib-minimal_abi_src_test'
 *          environment, line 1167:  Called multibuild_foreach_variant '_multilib_multibuild_wrapper' 'multilib-minimal_abi_src_test'
 *          environment, line  860:  Called _multibuild_run '_multilib_multibuild_wrapper' 'multilib-minimal_abi_src_test'
 *          environment, line  858:  Called _multilib_multibuild_wrapper 'multilib-minimal_abi_src_test'
 *          environment, line  258:  Called multilib-minimal_abi_src_test
 *          environment, line  991:  Called default_src_test
 *, line  882:  Called __eapi0_src_test
 *, line  763:  Called die
 * The specific snippet of code:
 *              $emake_cmd ${internal_opts} check || \
 *                      die "Make check failed. See above for details."

Current github master has the same problem.

# emerge --info =dev-libs/libatomic_ops-7.6.0
Portage 2.3.13 (python 3.5.4-final-0, default/linux/amd64/13.0/desktop/plasma/systemd, gcc-7.2.0, glibc-2.25-r9, 4.12.12-gentoo x86_64)
                         System Settings
System uname: Linux-4.12.12-gentoo-x86_64-Intel-R-_Core-TM-_i7-2600_CPU_@_3.40GHz-with-gentoo-2.4.1
KiB Mem:    15864960 total,   2373796 free
KiB Swap:    8171516 total,   8136016 free
Timestamp of repository gentoo: Mon, 20 Nov 2017 07:45:01 +0000
Head commit of repository gentoo: 771285a9b67a87ff1c83833027aca305680700e0
sh dash
ld GNU gold (Gentoo 2.28.1 p1.0 2.28.1) 1.14
distcc 3.2rc1 x86_64-pc-linux-gnu [enabled]
ccache version 3.3.4 [disabled]
app-shells/bash:          4.3_p48-r1::gentoo
dev-java/java-config:     2.2.0-r3::gentoo
dev-lang/perl:            5.26.1-r1::gentoo
dev-lang/python:          2.7.14::gentoo, 3.5.4::gentoo
dev-util/ccache:          3.3.4-r1::gentoo
dev-util/cmake:           3.8.2::gentoo
dev-util/pkgconfig:       0.29.2::gentoo
sys-apps/baselayout:      2.4.1-r2::gentoo
sys-apps/sandbox:         2.10-r4::gentoo
sys-devel/autoconf:       2.13::gentoo, 2.69::gentoo
sys-devel/automake:       1.15-r2::gentoo
sys-devel/binutils:       2.28.1::gentoo
sys-devel/gcc:            6.4.0::gentoo, 7.2.0::gentoo
sys-devel/gcc-config:     1.8-r1::gentoo
sys-devel/libtool:        2.4.6-r3::gentoo
sys-devel/make:           4.2.1::gentoo
sys-kernel/linux-headers: 4.10::gentoo (virtual/os-headers)
sys-libs/glibc:           2.25-r9::gentoo

    location: /usr/portage
    sync-type: rsync
    sync-uri: rsync://
    priority: -1000

    location: /usr/local/portage
    masters: gentoo
    priority: 0

CFLAGS="-O2 -pipe -march=sandybridge -msahf --param l1-cache-size=32 --param l1-cache-line-size=64 --param l2-cache-size=8192 -flto=8 -fuse-linker-plugin"
CONFIG_PROTECT="/etc /usr/lib64/libreoffice/program/sofficerc /usr/share/config /usr/share/gnupg/qualified.txt"
CONFIG_PROTECT_MASK="/etc/ca-certificates.conf /etc/dconf /etc/env.d /etc/fonts/fonts.conf /etc/gconf /etc/gentoo-release /etc/php/apache2-php7.0/ext-active/ /etc/php/cgi-php7.0/ext-active/ /etc/php/cli-php7.0/ext-active/ /etc/revdep-rebuild /etc/sandbox.d /etc/terminfo"
CXXFLAGS="-O2 -pipe -march=sandybridge -msahf --param l1-cache-size=32 --param l1-cache-line-size=64 --param l2-cache-size=8192 -flto=8 -fuse-linker-plugin"
EMERGE_DEFAULT_OPTS="--keep-going y --with-bdeps y"
FCFLAGS="-O2 -pipe"
FEATURES="assume-digests binpkg-logs cgroup compress-build-logs config-protect-if-modified distcc distlocks ebuild-locks ipc-sandbox merge-sync multilib-strict news parallel-fetch protect-owned sandbox sfperms split-elog split-log strict test unknown-features-warn unmerge-logs unmerge-orphans userfetch userpriv usersandbox usersync xattr"
FFLAGS="-O2 -pipe"
LDFLAGS="-Wl,-O1 -Wl,--as-needed -Wl,--hash-style=gnu -Wl,--sort-common -flto=8 -fuse-linker-plugin"
MAKEOPTS="-j11 -l8"
PORTAGE_RSYNC_OPTS="--recursive --links --safe-links --perms --times --omit-dir-times --compress --force --whole-file --delete --stats --human-readable --timeout=180 --exclude=/distfiles --exclude=/local --exclude=/packages --exclude=/.git"
USE="X a52 aac aalib acl acpi activities adns alsa amd64 ao audiofile bash-completion bluetooth branding bzip2 cairo caps cdda cddb cdparanoia cdr cli cracklib crypt css cups curl cxx dbus declarative dga djvu dri dts dvd dvdr emboss encode exif expat fbcon ffmpeg fftw firefox flac fontconfig foomaticdb fortran ftp gd gdbm geoip gif gimp glamor gmp gnutls gphoto2 gpm graphviz gtk handbook iconv icu idn imagemagick imlib ipv6 java javascript jbig jpeg jpeg2k kde kipi kwallet lame lcms libass libcaca libnotify libsamplerate lm_sensors lua lzma lzo mad mmap mng modules mp3 mp4 mpeg mplayer multilib musicbrainz ncurses nls nptl nsplugin offensive ogg openal openexr opengl openmp pam pango pcre pdf phonon plasma png policykit postscript ppds pulseaudio qml qt3support qt4 qt5 rdesktop readline recode samba sctp sdl seccomp session sndfile sockets speex spell sqlite ssl startup-notification subversion svg symlink syslog systemd sysvipc taglib theora threads tidy tiff truetype udev udisks unicode upower usb vaapi vcd vim-syntax vnc vorbis wayland widgets win32codecs wmf wxwidgets x264 xattr xcb xcomposite xine xinerama xml xpm xscreensaver xv xvid yahoo zlib" ABI_X86="64" ALSA_CARDS="hda-intel virmidi" APACHE2_MODULES="authn_core authz_core socache_shmcb unixd actions alias auth_basic authn_alias authn_anon authn_dbm authn_default authn_file authz_dbm authz_default authz_groupfile authz_host authz_owner authz_user autoindex cache cgi cgid dav dav_fs dav_lock deflate dir disk_cache env expires ext_filter file_cache filter headers include info log_config logio mem_cache mime mime_magic negotiation rewrite setenvif speling status unique_id userdir usertrack vhost_alias" CALLIGRA_FEATURES="kexi words flow plan sheets stage tables krita karbon braindump author" CAMERAS="kodak ptp2" COLLECTD_PLUGINS="df interface irq load memory rrdtool swap syslog" CPU_FLAGS_X86="aes avx mmx mmxext popcnt sse sse2 sse3 sse4_1 sse4_2 ssse3" CURL_SSL="gnutls" ELIBC="glibc" GPSD_PROTOCOLS="ashtech aivdm earthmate evermore fv18 garmin garmintxt gpsclock isync itrax mtk3301 nmea ntrip navcom oceanserver oldstyle oncore rtcm104v2 rtcm104v3 sirf skytraq superstar2 timing tsip tripmate tnt ublox ubx" GRUB_PLATFORMS="pc" INPUT_DEVICES="libinput" KERNEL="linux" L10N="it en" LCD_DEVICES="bayrad cfontz cfontz633 glk hd44780 lb216 lcdm001 mtxorb ncurses text" LIBREOFFICE_EXTENSIONS="nlpsolver" LINGUAS="it it_IT" OFFICE_IMPLEMENTATION="libreoffice" PHP_TARGETS="php5-6 php7-0" POSTGRES_TARGETS="postgres9_5" PYTHON_TARGETS="python2_7 python3_5 pypy pypy3" RUBY_TARGETS="ruby22" USERLAND="GNU" VIDEO_CARDS="intel i965" XTABLES_ADDONS="quota2 psd pknock lscan length2 ipv4options ipset ipp2p iface geoip fuzzy condition tee tarpit sysrq steal rawnat logmark ipmark dhcpmac delude chaos account"

                        Package Settings

dev-libs/libatomic_ops-7.6.0::gentoo was built with the following:
USE="" ABI_X86="(64) -32 (-x32)"

# emerge -1pqv =dev-libs/libatomic_ops-7.6.0
[ebuild   R   ] dev-libs/libatomic_ops-7.6.0  ABI_X86="(64) -32 (-x32)"
Comment 1 Paolo Pedroni 2017-11-20 15:28:36 UTC
With gcc-6.4.0 it used to work fine...
Comment 2 Matt Turner gentoo-dev 2018-03-27 23:56:07 UTC
*** Bug 641410 has been marked as a duplicate of this bug. ***
Comment 3 Matt Turner gentoo-dev 2018-03-28 00:02:57 UTC
Still broken in 7.6.4.
Comment 4 Larry the Git Cow gentoo-dev 2018-04-04 21:10:07 UTC
The bug has been referenced in the following commit(s):

commit 0de10539d62af83b0f319aa62a8fac2f9b439387
Author:     Peter Levine <>
AuthorDate: 2018-03-31 05:19:48 +0000
Commit:     Andreas Sturmlechner <>
CommitDate: 2018-04-04 21:09:32 +0000

    dev-libs/libatomic_ops: Fix building with GCC-7
    Package-Manager: Portage-2.3.16, Repoman-2.3.6

 .../files/libatomic_ops-7.6.4-gcc7.patch           | 40 ++++++++++++++++++++++
 dev-libs/libatomic_ops/libatomic_ops-7.6.4.ebuild  |  2 ++
 2 files changed, 42 insertions(+)}