Gentoo Websites Logo
Go to: Gentoo Home Documentation Forums Lists Bugs Planet Store Wiki Get Gentoo!
Bug 634648 - >>>===media-libs/faac- on non-x86 - .../work/faac-1.29.8/libfaac/quantize.c:21:23: fatal error: immintrin.h: No such file or directory
Summary: >>>===media-libs/faac- on non-x86 - .../work/faac-1.29.8/libfaac/quan...
Alias: None
Product: Gentoo Linux
Classification: Unclassified
Component: Current packages (show other bugs)
Hardware: All Linux
: Normal normal (vote)
Assignee: Gentoo Sound Team
Depends on:
Reported: 2017-10-18 16:20 UTC by Jeroen Roovers (RETIRED)
Modified: 2018-12-13 18:55 UTC (History)
0 users

See Also:
Package list:
Runtime testing required: ---

media-libs:faac-1.29.8:20171018-155716.log (media-libs:faac-1.29.8:20171018-155716.log,21.10 KB, text/plain)
2017-10-18 16:20 UTC, Jeroen Roovers (RETIRED)

Note You need to log in before you can comment on or make changes to this bug.
Description Jeroen Roovers (RETIRED) gentoo-dev 2017-10-18 16:20:53 UTC
Created attachment 499076 [details]

/var/tmp/portage/media-libs/faac-1.29.8/work/faac-1.29.8/libfaac/quantize.c:21:23: fatal error: immintrin.h: No such file or directory
 #include <immintrin.h>
compilation terminated.
make[2]: *** [Makefile:595: libfaac_la-quantize.lo] Error 1
make[2]: *** Waiting for unfinished jobs....
libtool: compile:  hppa2.0-unknown-linux-gnu-gcc -DHAVE_CONFIG_H -I. -I/var/tmp/portage/media-libs/faac-1.29.8/work/faac-1.29.8/libfaac -I.. -I/var/tmp/portage/media-libs/faac-1.29.8/work/faac-1.29.8/include -fvisibility=hidden -mschedule=8000 -march=2.0 -ggdb -Wall -O2 -pipe -Wno-comment -c /var/tmp/portage/media-libs/faac-1.29.8/work/faac-1.29.8/libfaac/huff2.c  -fPIC -DPIC -o .libs/libfaac_la-huff2.o
make[2]: Leaving directory '/var/tmp/portage/media-libs/faac-1.29.8/work/faac-1.29.8-.hppa/libfaac'
make[1]: *** [Makefile:395: all-recursive] Error 1
make[1]: Leaving directory '/var/tmp/portage/media-libs/faac-1.29.8/work/faac-1.29.8-.hppa'
make: *** [Makefile:327: all] Error 2
 * ERROR: media-libs/faac-1.29.8::gentoo failed (compile phase):
Comment 1 Jeroen Roovers (RETIRED) gentoo-dev 2017-10-18 17:35:36 UTC
Actually was fine and is unhappy, so SEMVER is probably unheard of upstream.
Comment 2 Steve Dibb (RETIRED) gentoo-dev 2018-12-13 18:55:34 UTC
jer, do you know if this is still a bug in