Gentoo Websites Logo
Go to: Gentoo Home Documentation Forums Lists Bugs Planet Store Wiki Get Gentoo!
Bug 629004 - dev-scheme/guile-2.0.14-r2 fails test 00-repl-server.test
Summary: dev-scheme/guile-2.0.14-r2 fails test 00-repl-server.test
Alias: None
Product: Gentoo Linux
Classification: Unclassified
Component: Current packages (show other bugs)
Hardware: All Linux
: Normal normal (vote)
Assignee: Scheme Project
Keywords: PullRequest, TESTFAILURE
Depends on:
Reported: 2017-08-27 00:27 UTC by eroen
Modified: 2019-07-08 16:12 UTC (History)
0 users

See Also:
Package list:
Runtime testing required: ---

dev-scheme/guile-2.0.14-r2:20170826-234439.log (guile-2.0.14-r2:20170826-234439.log,564.51 KB, text/plain)
2017-08-27 00:27 UTC, eroen
catch unbound make-socket-address variable and skip test (guile-2.0.14-tests-repl-server.patch,964 bytes, patch)
2019-06-23 11:10 UTC, Cyprien Nicolas (fulax)
Details | Diff

Note You need to log in before you can comment on or make changes to this bug.
Description eroen 2017-08-27 00:27:43 UTC
Created attachment 490770 [details]

make  check-TESTS
make[3]: Entering directory '/var/tmp/portage/dev-scheme/guile-2.0.14-r2/work/guile-2.0.14'
Testing /var/tmp/portage/dev-scheme/guile-2.0.14-r2/work/guile-2.0.14/meta/guile ...
with GUILE_LOAD_PATH=/var/tmp/portage/dev-scheme/guile-2.0.14-r2/work/guile-2.0.14/test-suite
Running 00-initial-env.test
Running 00-repl-server.test
ERROR: 00-repl-server.test: repl-server: simple expression - arguments: ((unbound-variable #f "Unbound variable: ~S" (make-socket-address) #f))
ERROR: 00-repl-server.test: repl-server: HTTP inter-protocol attack - arguments: ((unbound-variable #f "Unbound variable: ~S" (make-socket-address) #f))
Running 00-socket.test
Running web-uri.test

Totals for this test run:
passes:                 40268
failures:               0
unexpected passes:      0
expected failures:      9
unresolved test cases:  569
untested test cases:    1
unsupported test cases: 10
errors:                 2

[0;31mFAIL[m: check-guile
[0;31m1 of 1 test failed[m
[0;31mPlease report to[m
make[3]: *** [Makefile:1941: check-TESTS] Error 1
make[3]: Leaving directory '/var/tmp/portage/dev-scheme/guile-2.0.14-r2/work/guile-2.0.14'
make[2]: *** [Makefile:2223: check-am] Error 2
make[2]: Leaving directory '/var/tmp/portage/dev-scheme/guile-2.0.14-r2/work/guile-2.0.14'
make[1]: *** [Makefile:1841: check-recursive] Error 1
make[1]: Leaving directory '/var/tmp/portage/dev-scheme/guile-2.0.14-r2/work/guile-2.0.14'
make: *** [Makefile:2225: check] Error 2
 * ERROR: dev-scheme/guile-2.0.14-r2::gentoo failed (test phase):
 *   Make check failed. See above for details.
 * Call stack:
 *  , line  115:  Called src_test
 *          environment, line 2783:  Called default
 *, line  808:  Called default_src_test
 *, line  837:  Called __eapi0_src_test
 *, line  763:  Called die
 * The specific snippet of code:
 *   		$emake_cmd ${internal_opts} check || \
 *   			die "Make check failed. See above for details."
Comment 1 eroen 2017-08-27 00:29:08 UTC
eroen@occam ~ $ emerge --info '=dev-scheme/guile-2.0.14-r2::gentoo'
Portage 2.3.7 (python 3.6.1-final-0, hardened/linux/amd64, gcc-6.4.0, glibc-2.25-r4, 4.9.24-hardened-o0 x86_64)
                         System Settings
System uname: Linux-4.9.24-hardened-o0-x86_64-Intel-R-_Core-TM-_i5-2520M_CPU_@_2.50GHz-with-gentoo-2.4.1
KiB Mem:     8000768 total,   2678416 free
KiB Swap:   16777212 total,  16414880 free
Timestamp of repository gentoo: Sun, 20 Aug 2017 12:30:01 +0000
Head commit of repository gentoo: f49b572487044b635dadd0db10851963ab42ffda
Timestamp of repository eroen: Sun, 30 Oct 2016 21:58:42 +0000
Head commit of repository sapher: 9ef31d0bf6a902342746fb03a445d4f8b7ddabef

Head commit of repository wiktorb: 722797c27affae074c3d7b0a628cad1bdff2041c

Head commit of repository stuff: bbd9d235512712091f976ceec47f66fa2914583e

sh bash 4.4_p12
ld GNU ld (Gentoo 2.27 p1.1) 2.27
ccache version 3.3.4 [disabled]
app-shells/bash:          4.4_p12::gentoo
dev-java/java-config:     2.2.0-r3::gentoo
dev-lang/perl:            5.24.2::gentoo
dev-lang/python:          2.7.13::gentoo, 3.4.6::gentoo, 3.5.3::gentoo, 3.6.1-r1::gentoo
dev-util/ccache:          3.3.4::gentoo
dev-util/cmake:           3.9.1::gentoo
dev-util/pkgconfig:       0.29.2::gentoo
sys-apps/baselayout:      2.4.1-r1::gentoo
sys-apps/openrc:          0.28::gentoo
sys-apps/sandbox:         2.10-r4::gentoo
sys-devel/autoconf:       2.13::gentoo, 2.69-r4::gentoo
sys-devel/automake:       1.15.1::gentoo
sys-devel/binutils:       2.27-r1::gentoo, 2.28.1::gentoo
sys-devel/gcc:            5.3.0::gentoo, 5.4.0-r3::gentoo, 6.3.0::gentoo, 6.4.0::gentoo
sys-devel/gcc-config:     1.8-r1::gentoo
sys-devel/libtool:        2.4.6-r4::gentoo
sys-devel/make:           4.2.1-r1::gentoo
sys-kernel/linux-headers: 4.10::gentoo (virtual/os-headers)
sys-libs/glibc:           2.25-r4::gentoo

    location: /usr/portage
    sync-type: rsync
    sync-uri: rsync://
    priority: -1000
    sync-rsync-extra-opts: --exclude ChangeLog* --exclude /metadata/cache/ --stats --delay-updates -c

    location: /usr/local/portage
    masters: gentoo
    priority: 0

    location: /var/lib/overlays/sapher
    sync-type: git
    masters: gentoo

    location: /var/lib/overlays/wiktorb
    sync-type: git
    masters: gentoo

    location: /var/lib/layman/enlightenment
    masters: gentoo
    priority: 50

    location: /var/lib/layman/flora
    masters: gentoo
    priority: 50

    location: /var/lib/layman/gamerlay
    masters: gentoo
    priority: 50

    location: /var/lib/layman/glc
    masters: gentoo
    priority: 50

    location: /var/lib/layman/hardened-development
    masters: gentoo
    priority: 50

    location: /var/lib/layman/haskell
    masters: gentoo
    priority: 50

    location: /var/lib/layman/hasufell
    masters: gentoo
    priority: 50

    location: /var/lib/layman/java
    masters: gentoo
    priority: 50

    location: /var/lib/layman/laurentb
    masters: gentoo
    priority: 50

    location: /var/lib/layman/roslin
    masters: gentoo
    priority: 50

    location: /var/lib/layman/science
    masters: gentoo
    priority: 50

    location: /var/lib/layman/stuff
    sync-type: git
    masters: gentoo
    priority: 50

    location: /var/lib/layman/sunrise
    masters: gentoo
    priority: 50

    location: /var/lib/layman/toolchain
    masters: gentoo
    priority: 50

    location: /var/lib/layman/v-fox
    masters: gentoo
    priority: 50

ACCEPT_KEYWORDS="amd64 ~amd64"
CFLAGS="-march=corei7-avx -pipe -Og -g -gdwarf-4"
CONFIG_PROTECT="/etc /usr/share/config /usr/share/easy-rsa /usr/share/gnupg/qualified.txt"
CONFIG_PROTECT_MASK="/etc/ca-certificates.conf /etc/dconf /etc/env.d /etc/fonts/fonts.conf /etc/gconf /etc/gentoo-release /etc/revdep-rebuild /etc/sandbox.d /etc/terminfo /etc/texmf/language.dat.d /etc/texmf/language.def.d /etc/texmf/updmap.d /etc/texmf/web2c"
CXXFLAGS="-march=corei7-avx -pipe -Og -g -gdwarf-4"
EMERGE_DEFAULT_OPTS="--jobs=4 --autounmask --quiet-build --nospinner --verbose-conflicts --verbose-slot-rebuilds"
FCFLAGS="-O2 -pipe"
FEATURES="assume-digests binpkg-logs binpkg-multi-instance cgroup collision-protect compressdebug config-protect-if-modified distlocks ebuild-locks fixlafiles installsources ipc-sandbox merge-sync multilib-strict network-sandbox news parallel-fetch parallel-install preserve-libs protect-owned sandbox sfperms split-log splitdebug strict test unknown-features-warn unmerge-logs unmerge-orphans userfetch userpriv usersandbox usersync xattr"
FFLAGS="-O2 -pipe"
LDFLAGS="-Wl,-O1 -Wl,--as-needed -Wl,--hash-style=gnu"
MAKEOPTS="-j4 -l10"
PORTAGE_RSYNC_EXTRA_OPTS="--exclude ChangeLog* --exclude /metadata/cache/ --stats --delay-updates -c"
PORTAGE_RSYNC_OPTS="--recursive --links --safe-links --perms --times --omit-dir-times --compress --force --whole-file --delete --stats --human-readable --timeout=180 --exclude=/distfiles --exclude=/local --exclude=/packages --exclude=/.git"
USE="X a52 aac acl alsa amd64 apng audio audiofile avresample avx bash-completion bdf berkdb bluray bzip2 cairo caps cb cdda cdparanoia cdr cjk cli corefonts cracklib crypt cups curl cxx ddate declarative detex device-mapper dga dia djvu dri dts dvd dvi2tty dvipdfm ebook egl exif fam ffmpeg fftw fits flac fontconfig g3dvl gallium gbm gcrypt gdbm gif gimp git glamor glib glibc-omitfp gmp gnuplot gnutls gold gpm graphics graphviz gs gstreamer gtk gtk3 hardened highlight hscolour iconv icu id3tag idn imagemagick imlib inotify iproute2 ipv6 jbig jpeg jpeg2k jpg json justify kde kde4 kpathsea latex lcms libffi libssh2 libv4l luatex lvm lvm2 lzma lzo man metric mikmod mkv mms mmx mng modules mp3 mpeg mpg123 multilib multimedia musepack ncurses netlink nptl nut ocr odbc offensive ogg opengl openmp openvg optimization optimized-qmake opus pam pango pax_kernel pcre pdf pgf phonon pie png postscript private-headers pstricks pth publishers python3 qt3support qt4 raw readline samba sbsms scanner science sdl seccomp session smp sna sndfile speex spell sqlite sse sse2 sse3 sse4 sse41 sse4_1 sse4_2 ssh ssl ssp ssse3 svg t1lib tcpd tesseract theora threads tiff tls truetype udev unicode urandom usb v4l v4l2 vaapi video vorbis vpx webp wmf x264 xanim xattr xcb xcomposite xetex xft xinerama xkb xml xmlpatterns xorg xosd xpm xrandr xtpax xv xvid xvmc xz zlib zsh-completion" ABI_X86="32 64" APACHE2_MODULES="authn_core authz_core socache_shmcb unixd actions alias auth_basic authn_alias authn_anon authn_dbm authn_default authn_file authz_dbm authz_default authz_groupfile authz_host authz_owner authz_user autoindex cache cgi cgid dav dav_fs dav_lock deflate dir disk_cache env expires ext_filter file_cache filter headers include info log_config logio mem_cache mime mime_magic negotiation rewrite setenvif speling status unique_id userdir usertrack vhost_alias" CALLIGRA_FEATURES="kexi words flow plan sheets stage tables krita karbon braindump author" COLLECTD_PLUGINS="df interface irq load memory rrdtool swap syslog" CPU_FLAGS_X86="mmx sse sse2 avx sse3 ssse3 sse4_1 aes avx mmxext popcnt sse3 sse4_1 sse4_2 ssse3" CURL_SSL="openssl" ELIBC="glibc" GPSD_PROTOCOLS="ashtech aivdm earthmate evermore fv18 garmin garmintxt gpsclock isync itrax mtk3301 nmea ntrip navcom oceanserver oldstyle oncore rtcm104v2 rtcm104v3 sirf skytraq superstar2 timing tsip tripmate tnt ublox ubx" GRUB_PLATFORMS="efi-64" INPUT_DEVICES="mouse keyboard evdev synaptics wacom" KERNEL="linux" L10N="en en-US en-GB eng" LCD_DEVICES="bayrad cfontz cfontz633 glk hd44780 lb216 lcdm001 mtxorb ncurses text" LIBREOFFICE_EXTENSIONS="presenter-console presenter-minimizer" LINGUAS="en gb us en_US en_GB eng jbo no nb nn no_NO nb_NO nn_NO nor" LLVM_TARGETS="BPF X86" OFFICE_IMPLEMENTATION="libreoffice" PHP_TARGETS="php5-3" POSTGRES_TARGETS="postgres9_5" PYTHON_SINGLE_TARGET="python3_4" PYTHON_TARGETS="python2_7 python3_4 python3_5 python3_6" QEMU_SOFTMMU_TARGETS="x86_64 i386" RUBY_TARGETS="ruby22" SANE_BACKENDS="plustek" USERLAND="GNU" VIDEO_CARDS="intel i965 ilo" XTABLES_ADDONS="quota2 psd pknock lscan length2 ipv4options ipset ipp2p iface geoip fuzzy condition tee tarpit sysrq steal rawnat logmark ipmark dhcpmac delude chaos account"

eroen@occam ~ $ emerge -pqv '=dev-scheme/guile-2.0.14-r2::gentoo'
[ebuild  N    ] dev-scheme/guile-2.0.14-r2  USE="regex threads -debug -debug-malloc -deprecated -networking -nls"
Comment 2 Cyprien Nicolas (fulax) 2019-06-16 21:01:21 UTC
(In reply to eroen from comment #0)
> Running 00-repl-server.test
> ERROR: 00-repl-server.test: repl-server: simple expression - arguments:
> ((unbound-variable #f "Unbound variable: ~S" (make-socket-address) #f))
> ERROR: 00-repl-server.test: repl-server: HTTP inter-protocol attack -
> arguments: ((unbound-variable #f "Unbound variable: ~S"
> (make-socket-address) #f))

I guess disabling networking make this test to fail instead of skipping it.
Comment 3 Cyprien Nicolas (fulax) 2019-06-23 11:10:40 UTC
Created attachment 580570 [details, diff]
catch unbound make-socket-address variable and skip test

patch for 00-repl-server.test. Works on amd64 2.0.14 but seems not enough for 2.2.x.