Gentoo Websites Logo
Go to: Gentoo Home Documentation Forums Lists Bugs Planet Store Wiki Get Gentoo!
Bug 623578 - media-tv/linuxtv-dvb-apps fails install without '.' in @INC ( Can't locate atsc_psip_section.pl in @INC )
Summary: media-tv/linuxtv-dvb-apps fails install without '.' in @INC ( Can't locate at...
Status: RESOLVED FIXED
Alias: None
Product: Gentoo Linux
Classification: Unclassified
Component: Current packages (show other bugs)
Hardware: All Linux
: Normal normal (vote)
Assignee: No maintainer - Look at https://wiki.gentoo.org/wiki/Project:Proxy_Maintainers if you want to take care of it
URL:
Whiteboard:
Keywords:
Depends on: 626238 626240
Blocks: perl-5.26-no-dot-inc perl-5.26-unmask
  Show dependency tree
 
Reported: 2017-07-02 19:08 UTC by Kent Fredric (IRC: kent\n) (RETIRED)
Modified: 2017-08-28 11:20 UTC (History)
2 users (show)

See Also:
Package list:
Runtime testing required: ---


Attachments
build.log (linuxtv-dvb-apps-1.1.1.20100223-r1:20170702-190402.log,27.28 KB, text/plain)
2017-07-02 19:08 UTC, Kent Fredric (IRC: kent\n) (RETIRED)
Details

Note You need to log in before you can comment on or make changes to this bug.
Description Kent Fredric (IRC: kent\n) (RETIRED) gentoo-dev 2017-07-02 19:08:34 UTC
Created attachment 480046 [details]
build.log

See tracker for details.

make[2]: Leaving directory '/var/tmp/portage/media-tv/linuxtv-dvb-apps-1.1.1.20100223-r1/work/linuxtv-dvb-apps-1.1.1.20100223/util/dvbscan'
make -C femon all                                                                                                                                   
make[2]: Entering directory '/var/tmp/portage/media-tv/linuxtv-dvb-apps-1.1.1.20100223-r1/work/linuxtv-dvb-apps-1.1.1.20100223/util/femon'
x86_64-pc-linux-gnu-gcc -I../../lib -march=native -mtune=native -O2 -pipe -MMD -Wl,-O1 -Wl,--as-needed -L../../lib/libdvbapi -o femon femon.c   -ldvbapi
make[2]: Leaving directory '/var/tmp/portage/media-tv/linuxtv-dvb-apps-1.1.1.20100223-r1/work/linuxtv-dvb-apps-1.1.1.20100223/util/femon'
make -C scan all                                                                                                    
make[2]: Entering directory '/var/tmp/portage/media-tv/linuxtv-dvb-apps-1.1.1.20100223-r1/work/linuxtv-dvb-apps-1.1.1.20100223/util/scan'
perl section_generate.pl atsc_psip_section.pl                    
perl section_generate.pl atsc_psip_section.pl                                                                                                                                                                                                                                       
Can't locate atsc_psip_section.pl in @INC (@INC contains: /etc/perl /usr/local/lib64/perl5/5.26.0/x86_64-linux /usr/local/lib64/perl5/5.26.0 /usr/lib64/perl5/vendor_perl/5.26.0/x86_64-linux /usr/lib64/perl5/vendor_perl/5.26.0 /usr/local/lib64/perl5 /usr/lib64/perl5/vendor_perl/5.26.0-RC1 /usr/lib64/perl5/vendor_perl/5.25.12 /usr/lib64/perl5/vendor_perl/5.25.11 /usr/lib64/perl5/vendor_perl/5.22.3 /usr/lib64/perl5/vendor_perl /usr/lib64/perl5/5.26.0/x86_64-linux /usr/lib64/perl5/5.26.0) at section_generate.pl line 7.
make[2]: *** [Makefile:28: atsc_psip_section.c] Error 2                                                   
make[2]: *** Waiting for unfinished jobs....                                                                                                          
Can't locate atsc_psip_section.pl in @INC (@INC contains: /etc/perl /usr/local/lib64/perl5/5.26.0/x86_64-linux /usr/local/lib64/perl5/5.26.0 /usr/lib64/perl5/vendor_perl/5.26.0/x86_64-linux /usr/lib64/perl5/vendor_perl/5.26.0 /usr/local/lib64/perl5 /usr/lib64/perl5/vendor_perl/5.26.0-RC1 /usr/lib64/perl5/vendor_perl/5.25.12 /usr/lib64/perl5/vendor_perl/5.25.11 /usr/lib64/perl5/vendor_perl/5.22.3 /usr/lib64/perl5/vendor_perl /usr/lib64/perl5/5.26.0/x86_64-linux /usr/lib64/perl5/5.26.0) at section_generate.pl line 7.
make[2]: *** [Makefile:28: atsc_psip_section.h] Error 2                                                                                                                                   
make[2]: Leaving directory '/var/tmp/portage/media-tv/linuxtv-dvb-apps-1.1.1.20100223-r1/work/linuxtv-dvb-apps-1.1.1.20100223/util/scan'                  
make[1]: *** [Makefile:15: all] Error 2                                                                                                                       
make[1]: Leaving directory '/var/tmp/portage/media-tv/linuxtv-dvb-apps-1.1.1.20100223-r1/work/linuxtv-dvb-apps-1.1.1.20100223/util'                                                                     
make: *** [Makefile:7: all] Error 2                                                                                                                   
 * ERROR: media-tv/linuxtv-dvb-apps-1.1.1.20100223-r1::gentoo failed (compile phase):
Comment 1 Pacho Ramos gentoo-dev 2017-07-03 09:44:17 UTC
We would need to move this to take periodical snapshots as our version is completely outdated
Comment 2 Andreas K. Hüttel archtester gentoo-dev 2017-08-06 08:38:38 UTC
Fixed