Gentoo Websites Logo
Go to: Gentoo Home Documentation Forums Lists Bugs Planet Store Wiki Get Gentoo!
Bug 612132 - app-emulation/virtualbox: /.../sysfs.cpp:493:58: error: ‘makedev’ was not declared in this scope
Summary: app-emulation/virtualbox: /.../sysfs.cpp:493:58: error: ‘makedev’ was not dec...
Status: RESOLVED FIXED
Alias: None
Product: Gentoo Linux
Classification: Unclassified
Component: Current packages (show other bugs)
Hardware: All Linux
: Normal normal (vote)
Assignee: Lars Wendler (Polynomial-C)
URL:
Whiteboard:
Keywords:
Depends on:
Blocks: glibc-sysmacros
  Show dependency tree
 
Reported: 2017-03-09 17:11 UTC by Toralf Förster
Modified: 2017-03-28 16:32 UTC (History)
3 users (show)

See Also:
Package list:
Runtime testing required: ---


Attachments
emerge-info.txt (emerge-info.txt,5.78 KB, text/plain)
2017-03-09 17:11 UTC, Toralf Förster
Details
app-emulation:virtualbox-5.1.16:20170309-143011.log.bz2 (app-emulation:virtualbox-5.1.16:20170309-143011.log.bz2,17.11 KB, application/x-bzip)
2017-03-09 17:11 UTC, Toralf Förster
Details
emerge-history.txt (emerge-history.txt,312.93 KB, text/plain)
2017-03-09 17:11 UTC, Toralf Förster
Details
environment (environment,224.82 KB, text/plain)
2017-03-09 17:11 UTC, Toralf Förster
Details
etc.portage.tbz2 (etc.portage.tbz2,26.17 KB, application/x-bzip)
2017-03-09 17:11 UTC, Toralf Förster
Details
temp.tbz2 (temp.tbz2,64.18 KB, application/x-bzip)
2017-03-09 17:12 UTC, Toralf Förster
Details

Note You need to log in before you can comment on or make changes to this bug.
Description Toralf Förster gentoo-dev 2017-03-09 17:11:42 UTC
x86_64-pc-linux-gnu-g++ -c -O2 -g -pipe -pedantic -Wshadow -Wall -Wextra -Wno-missing-field-initializers -Wno-unused -Wno-trigraphs -fdiagnostics-show-option -Wno-unused-parameter    -Wlogical-op   -Wno-variadic-macros -Wno-long-long -Wunused-variable -Wunused-function -Wunused-label -Wunused-parameter  -Wno-overloaded-virtual -Wno-variadic-macros  -O2 -fno-omit-frame-pointer -fno-strict-aliasing -m64 -I/var/tmp/portage/app-emulation/virtualbox-5.1.16/work/VirtualBox-5.1.16/src/VBox/Runtime/include -I/var/tmp/portage/app-emulation/virtualbox-5.1.16/work/VirtualBox-5.1.16/src/libs/liblzf-3.4 -I/var/tmp/portage/app-emulation/virtualbox-5.1.16/work/VirtualBox-5.1.16/src/libs/kStuff/kStuff/include -I/usr/include/libxml2 -I/var/tmp/portage/app-emulation/virtualbox-5.1.16/work/VirtualBox-5.1.16/include -I/var/tmp/portage/app-emulation/virtualbox-5.1.16/work/VirtualBox-5.1.16/out/linux.amd64/release -DVBOX -DVBOX_OSE -DVBOX_WITH_64_BITS_GUESTS -DVBOX_WITH_REM -DVBOX_WITH_RAW_MODE -DRT_OS_LINUX -D_FILE_OFFSET_BITS=64 -DRT_ARCH_AMD64 -D__AMD64__ -DVBOX_WITH_DEBUGGER -DVBOX_WITH_HARDENING -DRTPATH_APP_PRIVATE=\"/usr/share/virtualbox\" -DRTPATH_APP_PRIVATE_ARCH=\"/usr/lib64/virtualbox\" -DRTPATH_SHARED_LIBS=\"/usr/lib64/virtualbox\" -DRTPATH_APP_DOCS=\"\" -D_REENTRANT -DIN_RING3 -DLOG_DISABLED -DIN_BLD_PROG -DIN_RT_R3 -DIN_ADV_BLD_PROG -DIN_RT_R3 -DLDR_WITH_NATIVE -DLDR_WITH_ELF32 -DLDR_WITH_PE -DRT_WITH_VBOX -DRT_NO_GIP -DRT_WITHOUT_NOCRT_WRAPPERS -DIPRT_WITH_OPENSSL -DNOFILEID -DLDR_WITH_KLDR -DRT_WITH_ICONV_CACHE -DIPRT_WITHOUT_LDR_VERIFY -DRT_NO_GIP -Wp,-MD,/var/tmp/portage/app-emulation/virtualbox-5.1.16/work/VirtualBox-5.1.16/out/linux.amd64/release/obj/RuntimeBldProg/r3/linux/sysfs.o.dep -Wp,-MT,/var/tmp/portage/app-emulation/virtualbox-5.1.16/work/VirtualBox-5.1.16/out/linux.amd64/release/obj/RuntimeBldProg/r3/linux/sysfs.o -Wp,-MP -o /var/tmp/portage/app-emulation/virtualbox-5.1.16/work/VirtualBox-5.1.16/out/linux.amd64/release/obj/RuntimeBldProg/r3/linux/sysfs.o /var/tmp/portage/app-emulation/virtualbox-5.1.16/work/VirtualBox-5.1.16/src/VBox/Runtime/r3/linux/sysfs.cpp
/var/tmp/portage/app-emulation/virtualbox-5.1.16/work/VirtualBox-5.1.16/src/VBox/Runtime/r3/linux/sysfs.cpp: In function ‘int RTLinuxSysFsReadDevNumFileV(dev_t*, const char*, __va_list_tag*)’:
/var/tmp/portage/app-emulation/virtualbox-5.1.16/work/VirtualBox-5.1.16/src/VBox/Runtime/r3/linux/sysfs.cpp:493:58: error: ‘makedev’ was not declared in this scope
                         *pDevNum = makedev(u32Maj, u32Min);
                                                          ^
kmk: *** [/var/tmp/portage/app-emulation/virtualbox-5.1.16/work/VirtualBox-5.1.16/out/linux.amd64/release/obj/RuntimeBldProg/r3/linux/sysfs.o] Error 1

  -----------------------------------------------------------------

  This is an unstable amd64 chroot image (named gnome-systemd_20170301-222559) at a hardened host acting as a tinderbox.

  -----------------------------------------------------------------

gcc-config -l:
 [1] x86_64-pc-linux-gnu-5.4.0 *
llvm-config:
3.9.1
Available Python interpreters, in order of preference:
  [1]   python3.4
  [2]   python2.7 (fallback)
Available Ruby profiles:
  [1]   ruby21 (with Rubygems) *
java-config:
The following VMs are available for generation-2:
1)	IcedTea JDK 7.2.6.9 [icedtea-7]
*)	IcedTea JDK 7.2.6.9 [icedtea-bin-7]
3)	IcedTea JDK 3.3.0 [icedtea-bin-8]
Available Java Virtual Machines:
  [1]   icedtea-7 
  [2]   icedtea-bin-7  system-vm
  [3]   icedtea-bin-8
Comment 1 Toralf Förster gentoo-dev 2017-03-09 17:11:45 UTC
Created attachment 466438 [details]
emerge-info.txt
Comment 2 Toralf Förster gentoo-dev 2017-03-09 17:11:48 UTC
Created attachment 466440 [details]
app-emulation:virtualbox-5.1.16:20170309-143011.log.bz2
Comment 3 Toralf Förster gentoo-dev 2017-03-09 17:11:51 UTC
Created attachment 466442 [details]
emerge-history.txt
Comment 4 Toralf Förster gentoo-dev 2017-03-09 17:11:54 UTC
Created attachment 466444 [details]
environment
Comment 5 Toralf Förster gentoo-dev 2017-03-09 17:11:57 UTC
Created attachment 466446 [details]
etc.portage.tbz2
Comment 6 Toralf Förster gentoo-dev 2017-03-09 17:12:01 UTC
Created attachment 466448 [details]
temp.tbz2
Comment 7 Lars Wendler (Polynomial-C) gentoo-dev 2017-03-28 16:32:33 UTC
commit 3798cc506831f3d2c01eb484e78adb6134e11ada
Author: Lars Wendler <polynomial-c@gentoo.org>
Date:   Tue Mar 28 18:31:21 2017

    app-emulation/virtualbox: New patchset to fix sysmacro breakage (#612132)

    Package-Manager: Portage-2.3.5, Repoman-2.3.2