Gentoo Websites Logo
Go to: Gentoo Home Documentation Forums Lists Bugs Planet Store Wiki Get Gentoo!
Bug 609450 - media-libs/gstreamer fails gst/gstpipeline test
Summary: media-libs/gstreamer fails gst/gstpipeline test
Status: CONFIRMED
Alias: None
Product: Gentoo Linux
Classification: Unclassified
Component: Current packages (show other bugs)
Hardware: All Linux
: Normal normal (vote)
Assignee: GStreamer package maintainers
URL:
Whiteboard:
Keywords: TESTFAILURE
Depends on:
Blocks:
 
Reported: 2017-02-15 17:18 UTC by Markus Meier
Modified: 2018-07-30 06:58 UTC (History)
1 user (show)

See Also:
Package list:
Runtime testing required: ---


Attachments
media-libs:gstreamer-1.10.3:20170214-184004.log (media-libs:gstreamer-1.10.3:20170214-184004.log,884.58 KB, text/x-log)
2017-02-15 17:18 UTC, Markus Meier
Details

Note You need to log in before you can comment on or make changes to this bug.
Description Markus Meier gentoo-dev 2017-02-15 17:18:07 UTC
Created attachment 463864 [details]
media-libs:gstreamer-1.10.3:20170214-184004.log

Not sure if this is a regression or not.

 * Package:    media-libs/gstreamer-1.10.3
 * Repository: gentoo
 * Maintainer: gstreamer@gentoo.org
 * USE:        arm caps elibc_glibc introspection kernel_linux nls test userland_GNU
 * FEATURES:   preserve-libs sandbox test userpriv usersandbox

PASS: gst/gstpad
FAIL: gst/gstpipeline
PASS: gst/gstprotection
PASS: gst/gstprintf
...snip...
============================================================================
Testsuite summary for GStreamer 1.10.3
============================================================================
# TOTAL: 102
# PASS:  101
# SKIP:  0
# XFAIL: 0
# FAIL:  1
# XPASS: 0
# ERROR: 0
============================================================================
See tests/check/test-suite.log
Please report to http://bugzilla.gnome.org/enter_bug.cgi?product=GStreamer
============================================================================
Makefile:2648: recipe for target 'test-suite.log' failed
make[4]: *** [test-suite.log] Error 1
make[4]: Leaving directory '/var/tmp/portage/media-libs/gstreamer-1.10.3/work/gstreamer-1.10.3-.arm/tests/check'
Makefile:2754: recipe for target 'check-TESTS' failed
make[3]: *** [check-TESTS] Error 2
make[3]: Leaving directory '/var/tmp/portage/media-libs/gstreamer-1.10.3/work/gstreamer-1.10.3-.arm/tests/check'
Makefile:3527: recipe for target 'check-am' failed
make[2]: *** [check-am] Error 2
make[2]: Leaving directory '/var/tmp/portage/media-libs/gstreamer-1.10.3/work/gstreamer-1.10.3-.arm/tests/check'
Makefile:583: recipe for target 'check-recursive' failed
make[1]: *** [check-recursive] Error 1
make[1]: Leaving directory '/var/tmp/portage/media-libs/gstreamer-1.10.3/work/gstreamer-1.10.3-.arm/tests'
Makefile:768: recipe for target 'check-recursive' failed
make: *** [check-recursive] Error 1
 * ERROR: media-libs/gstreamer-1.10.3::gentoo failed (test phase):
 *   Make check failed. See above for details.
 * 
 * Call stack:
 *            ebuild.sh, line  115:  Called src_test
 *          environment, line 3414:  Called multilib-minimal_src_test
 *          environment, line 2659:  Called multilib_foreach_abi 'multilib-minimal_abi_src_test'
 *          environment, line 2831:  Called multibuild_foreach_variant '_multilib_multibuild_wrapper' 'multilib-minimal_abi_src_test'
 *          environment, line 2524:  Called _multibuild_run '_multilib_multibuild_wrapper' 'multilib-minimal_abi_src_test'
 *          environment, line 2522:  Called _multilib_multibuild_wrapper 'multilib-minimal_abi_src_test'
 *          environment, line  526:  Called multilib-minimal_abi_src_test
 *          environment, line 2655:  Called default_src_test
 *   phase-functions.sh, line  836:  Called __eapi0_src_test
 *     phase-helpers.sh, line  763:  Called die


Portage 2.3.3 (python 2.7.12-final-0, default/linux/arm/13.0/armv5te/desktop, gcc-4.9.4, glibc-2.23-r3, 3.10.25-gentoo armv5tel)
=================================================================
System uname: Linux-3.10.25-gentoo-armv5tel-Feroceon_88FR131_rev_1_-v5l-with-gentoo-2.3
KiB Mem:      513244 total,    235992 free
KiB Swap:    1535996 total,   1510860 free
Timestamp of repository gentoo: Mon, 13 Feb 2017 20:30:01 +0000
sh bash 4.3_p48-r1
ld GNU ld (Gentoo 2.25.1 p1.1) 2.25.1
distcc 3.2rc1 armv5tel-softfloat-linux-gnueabi [disabled]
ccache version 3.2.4 [disabled]
app-shells/bash:          4.3_p48-r1::gentoo
dev-lang/perl:            5.22.3_rc4::gentoo
dev-lang/python:          2.7.12::gentoo, 3.4.5::gentoo
dev-util/ccache:          3.2.4::gentoo
dev-util/cmake:           3.6.3::gentoo
sys-apps/baselayout:      2.3::gentoo
sys-apps/openrc:          0.22.4::gentoo
sys-apps/sandbox:         2.10-r1::gentoo
sys-devel/autoconf:       2.13::gentoo, 2.69::gentoo
sys-devel/automake:       1.4_p6-r2::gentoo, 1.5-r2::gentoo, 1.6.3-r2::gentoo, 1.7.9-r3::gentoo, 1.8.5-r5::gentoo, 1.9.6-r4::gentoo, 1.10.3-r1::gentoo, 1.11.6-r1::gentoo, 1.12.6::gentoo, 1.13.4::gentoo, 1.14.1::gentoo, 1.15::gentoo
sys-devel/binutils:       2.25.1-r1::gentoo
sys-devel/gcc:            4.9.4::gentoo
sys-devel/gcc-config:     1.7.3::gentoo
sys-devel/libtool:        2.4.6-r2::gentoo
sys-devel/make:           4.1-r1::gentoo
sys-kernel/linux-headers: 4.4::gentoo (virtual/os-headers)
sys-libs/glibc:           2.23-r3::gentoo
Repositories:

gentoo
    location: /usr/portage
    sync-type: rsync
    sync-uri: rsync://192.168.1.100/gentoo-portage
    priority: -1000

ACCEPT_KEYWORDS="arm"
ACCEPT_LICENSE="* -@EULA"
CBUILD="armv5tel-softfloat-linux-gnueabi"
CFLAGS="-O2 -march=armv5te -pipe"
CHOST="armv5tel-softfloat-linux-gnueabi"
CONFIG_PROTECT="/etc /etc/omega.conf /etc/stunnel/stunnel.conf /usr/share/easy-rsa /usr/share/gnupg/qualified.txt /var/bind /var/vpopmail/etc"
CONFIG_PROTECT_MASK="/etc/ca-certificates.conf /etc/dconf /etc/env.d /etc/fonts/fonts.conf /etc/gconf /etc/gentoo-release /etc/php/apache2-php5.5/ext-active/ /etc/php/apache2-php5.6/ext-active/ /etc/php/cgi-php5.5/ext-active/ /etc/php/cgi-php5.6/ext-active/ /etc/php/cli-php5.5/ext-active/ /etc/php/cli-php5.6/ext-active/ /etc/revdep-rebuild /etc/sandbox.d /etc/terminfo /etc/texmf/language.dat.d /etc/texmf/language.def.d /etc/texmf/updmap.d /etc/texmf/web2c"
CXXFLAGS="-O2 -march=armv5te -pipe"
DISTDIR="/mnt/distfiles"
EMERGE_DEFAULT_OPTS="--quiet-build=n --jobs=2 --keep-going --with-bdeps=y --backtrack=3"
FCFLAGS="-O2 -pipe -march=armv5te"
FEATURES="assume-digests binpkg-logs collision-protect config-protect-if-modified distlocks ebuild-locks fixlafiles merge-sync news parallel-fetch preserve-libs protect-owned sandbox sfperms strict test test-fail-continue unknown-features-warn unmerge-logs unmerge-orphans userfetch userpriv usersandbox usersync xattr"
FFLAGS="-O2 -pipe -march=armv5te"
GENTOO_MIRRORS="http://distfiles.gentoo.org"
LANG="en_GB.utf8"
LDFLAGS="-Wl,-O1 -Wl,--as-needed"
MAKEOPTS="-j2"
PKGDIR="/usr/portage/packages"
PORTAGE_CONFIGROOT="/"
PORTAGE_RSYNC_OPTS="--recursive --links --safe-links --perms --times --omit-dir-times --compress --force --whole-file --delete --stats --human-readable --timeout=180 --exclude=/distfiles --exclude=/local --exclude=/packages --exclude=/.git"
PORTAGE_TMPDIR="/var/tmp"
USE="X a52 aac acl acpi alsa apache2 arm berkdb bluetooth branding bzip2 cairo cdda cdr cli consolekit cracklib crypt cups cxx dbus dri dts dvd dvdr emboss encode exif fam firefox flac fortran gdbm gif glamor gpm gtk iconv jpeg kpathsea lcms ldap libnotify mad mng modules mp3 mp4 mpeg ncurses nls nptl ogg opengl openmp pam pango pcre pdf png policykit ppds qt3support qt4 readline sdl seccomp session spell ssl startup-notification svg tcpd test tiff truetype udev udisks unicode upower usb vorbis wxwidgets xattr xcb xml xv xvid zlib" APACHE2_MODULES="authn_core authz_core socache_shmcb unixd actions alias auth_basic authn_alias authn_anon authn_dbm authn_default authn_file authz_dbm authz_default authz_groupfile authz_host authz_owner authz_user autoindex cache cgi cgid dav dav_fs dav_lock deflate dir disk_cache env expires ext_filter file_cache filter headers include info log_config logio mem_cache mime mime_magic negotiation rewrite setenvif speling status unique_id userdir usertrack vhost_alias" CALLIGRA_FEATURES="kexi words flow plan sheets stage tables krita karbon braindump author" COLLECTD_PLUGINS="df interface irq load memory rrdtool swap syslog" ELIBC="glibc" GPSD_PROTOCOLS="ashtech aivdm earthmate evermore fv18 garmin garmintxt gpsclock isync itrax mtk3301 nmea ntrip navcom oceanserver oldstyle oncore rtcm104v2 rtcm104v3 sirf skytraq superstar2 timing tsip tripmate tnt ublox ubx" INPUT_DEVICES="libinput keyboard mouse" KERNEL="linux" LCD_DEVICES="bayrad cfontz cfontz633 glk hd44780 lb216 lcdm001 mtxorb ncurses text" LIBREOFFICE_EXTENSIONS="presenter-console presenter-minimizer" OFFICE_IMPLEMENTATION="libreoffice" PHP_TARGETS="php5-2 php5-3" PYTHON_SINGLE_TARGET="python2_7" PYTHON_TARGETS="python2_7 python3_4" RUBY_TARGETS="ruby21" USERLAND="GNU" VIDEO_CARDS="exynos freedreno omap" XTABLES_ADDONS="quota2 psd pknock lscan length2 ipv4options ipset ipp2p iface geoip fuzzy condition tee tarpit sysrq steal rawnat logmark ipmark dhcpmac delude chaos account"
Unset:  CC, CPPFLAGS, CTARGET, CXX, INSTALL_MASK, LC_ALL, PORTAGE_BUNZIP2_COMMAND, PORTAGE_COMPRESS, PORTAGE_COMPRESS_FLAGS, PORTAGE_RSYNC_EXTRA_OPTS, USE_PYTHON
Comment 1 Thomas Deutschmann gentoo-dev Security 2018-07-20 15:03:26 UTC
Same test failure on x86 with gstreamer-1.14.1:

Running suite(s): GstPipeline
88%: Checks: 9, Failures: 1, Errors: 0
/var/tmp/portage/media-libs/gstreamer-1.14.1/work/gstreamer-1.14.1/tests/check/gst/gstpipeline.c:489:F:pipeline tests:test_base_time:0: early timestamp: 0:00:00.011300507 < 0:00:00.312365669
Check suite gst_pipeline ran in 0.986s (tests failed: 1)
FAIL gst/gstpipeline (exit status: 1)
Comment 2 Thomas Deutschmann gentoo-dev Security 2018-07-20 15:08:29 UTC
Cannot reproduce test failure all the times, i.e. sometimes it passes.