Gentoo Websites Logo
Go to: Gentoo Home Documentation Forums Lists Bugs Planet Store Wiki Get Gentoo!
Bug 595132 - dev-libs/cloog-0.18.4 with >=dev-libs/isl-0.16.1 fails tests
Summary: dev-libs/cloog-0.18.4 with >=dev-libs/isl-0.16.1 fails tests
Status: CONFIRMED
Alias: None
Product: Gentoo Linux
Classification: Unclassified
Component: Current packages (show other bugs)
Hardware: All Linux
: Normal normal (vote)
Assignee: Gentoo Toolchain Maintainers
URL:
Whiteboard:
Keywords:
: 595130 (view as bug list)
Depends on:
Blocks:
 
Reported: 2016-09-25 21:52 UTC by eroen
Modified: 2017-09-19 07:28 UTC (History)
0 users

See Also:
Package list:
Runtime testing required: ---


Attachments
build.log (build.log,53.98 KB, text/plain)
2016-09-25 21:52 UTC, eroen
Details
test-suite.log (test-suite.log,25.28 KB, text/plain)
2016-09-25 21:53 UTC, eroen
Details

Note You need to log in before you can comment on or make changes to this bug.
Description eroen 2016-09-25 21:52:05 UTC
Test suite passes with (stable) dev-libs/isl-0.15, but fails with dev-libs/isl-0.16.1 and dev-libs/isl-0.17.1.


make  check-TESTS
make[2]: Entering directory '/var/tmp/portage/dev-libs/cloog-0.18.4/work/cloog-0.18.4-abi_x86_64.amd64/test'
make[3]: Entering directory '/var/tmp/portage/dev-libs/cloog-0.18.4/work/cloog-0.18.4-abi_x86_64.amd64/test'
FAIL: check_c.sh
FAIL: check_fortran.sh
PASS: check_strided.sh
PASS: check_openscop.sh
FAIL: check_special.sh
make[4]: Entering directory '/var/tmp/portage/dev-libs/cloog-0.18.4/work/cloog-0.18.4-abi_x86_64.amd64/test'
cd ..; make  libcloog-isl.la
make[5]: Entering directory '/var/tmp/portage/dev-libs/cloog-0.18.4/work/cloog-0.18.4-abi_x86_64.amd64'
make[5]: 'libcloog-isl.la' is up to date.
make[5]: Leaving directory '/var/tmp/portage/dev-libs/cloog-0.18.4/work/cloog-0.18.4-abi_x86_64.amd64'
make[4]: Leaving directory '/var/tmp/portage/dev-libs/cloog-0.18.4/work/cloog-0.18.4-abi_x86_64.amd64/test'
============================================================================
Testsuite summary for cloog 0.18.4
============================================================================
# TOTAL: 5
# PASS:  2
# SKIP:  0
# XFAIL: 0
# FAIL:  3
# XPASS: 0
# ERROR: 0
============================================================================
See test/test-suite.log
Please report to cloog-development@googlegroups.com
============================================================================
Makefile:940: recipe for target 'test-suite.log' failed
make[3]: *** [test-suite.log] Error 1
make[3]: Leaving directory '/var/tmp/portage/dev-libs/cloog-0.18.4/work/cloog-0.18.4-abi_x86_64.amd64/test'
Makefile:1046: recipe for target 'check-TESTS' failed
make[2]: *** [check-TESTS] Error 2
make[2]: Leaving directory '/var/tmp/portage/dev-libs/cloog-0.18.4/work/cloog-0.18.4-abi_x86_64.amd64/test'
Makefile:1147: recipe for target 'check-am' failed
make[1]: *** [check-am] Error 2
make[1]: Leaving directory '/var/tmp/portage/dev-libs/cloog-0.18.4/work/cloog-0.18.4-abi_x86_64.amd64/test'
Makefile:1046: recipe for target 'check-recursive' failed
make: *** [check-recursive] Error 1
 * ERROR: dev-libs/cloog-0.18.4::gentoo failed (test phase):
 *   emake failed
Comment 1 eroen 2016-09-25 21:52:28 UTC
Created attachment 447920 [details]
build.log
Comment 2 eroen 2016-09-25 21:53:52 UTC
Created attachment 447922 [details]
test-suite.log

Failures are of the form

--- /var/tmp/portage/dev-libs/cloog-0.18.4/work/cloog-0.18.4/test/darte.c	2014-10-02 14:03:59.000000000 +0000
+++ cloog_temp	2016-09-25 21:48:20.169924484 +0000
@@ -16,7 +16,7 @@
     for (t2=max(-t1+2,t1+3);t2<=-t1+4;t2++) {
       for (t3=t2+2;t3<=t2+2*n;t3++) {
         if ((t1+t2)%2 == 0) {
-          if ((t1+t3)%2 == 0) {
+          if ((t2+t3)%2 == 0) {
             S1(((t1+t2)/2),((-t1+t2)/2),((-t2+t3)/2));
           }
         }
@@ -33,14 +33,14 @@
           S2(((t1+t2-3)/2),((-t1+t2-1)/2),t3);
         }
         if ((t1+t2)%2 == 0) {
-          if ((t1+t3)%2 == 0) {
+          if ((t2+t3)%2 == 0) {
             S1(((t1+t2)/2),((-t1+t2)/2),((-t2+t3)/2));
           }
         }
       }
       for (t3=max(n+1,t2+2);t3<=t2+2*n;t3++) {
         if ((t1+t2)%2 == 0) {
-          if ((t1+t3)%2 == 0) {
+          if ((t2+t3)%2 == 0) {
             S1(((t1+t2)/2),((-t1+t2)/2),((-t2+t3)/2));
           }
         }
[31mFAIL: /var/tmp/portage/dev-libs/cloog-0.18.4/work/cloog-0.18.4/test/darte.c has a problem[0m
Comment 3 eroen 2016-09-25 21:54:27 UTC
localhost ~ # emerge --info '=dev-libs/cloog-0.18.4::gentoo'
Portage 2.2.28 (python 3.4.3-final-0, default/linux/amd64/13.0, gcc-4.9.3, glibc-2.22-r4, 4.4.6-gentoo x86_64)
=================================================================
                         System Settings
=================================================================
System uname: Linux-4.4.6-gentoo-x86_64-Intel-R-_Core-TM-_i5-2520M_CPU_@_2.50GHz-with-gentoo-2.2
KiB Mem:     4043380 total,   3788176 free
KiB Swap:          0 total,         0 free
Timestamp of repository gentoo: Sun, 25 Sep 2016 00:45:01 +0000
sh bash 4.3_p46-r1
ld GNU ld (Gentoo 2.25.1 p1.1) 2.25.1
app-shells/bash:          4.3_p46-r1::gentoo
dev-lang/perl:            5.22.2::gentoo
dev-lang/python:          2.7.10-r1::gentoo, 3.4.3-r1::gentoo
dev-util/pkgconfig:       0.28-r2::gentoo
sys-apps/baselayout:      2.2::gentoo
sys-apps/openrc:          0.21.7::gentoo
sys-apps/sandbox:         2.10-r1::gentoo
sys-devel/autoconf:       2.69::gentoo
sys-devel/automake:       1.14.1::gentoo, 1.15::gentoo
sys-devel/binutils:       2.25.1-r1::gentoo
sys-devel/gcc:            4.9.3::gentoo
sys-devel/gcc-config:     1.7.3::gentoo
sys-devel/libtool:        2.4.6::gentoo
sys-devel/make:           4.1-r1::gentoo
sys-kernel/linux-headers: 4.3::gentoo (virtual/os-headers)
sys-libs/glibc:           2.22-r4::gentoo
Repositories:

gentoo
    location: /usr/portage
    sync-type: rsync
    sync-uri: rsync://rsync.gentoo.org/gentoo-portage
    priority: -1000

ACCEPT_KEYWORDS="amd64"
ACCEPT_LICENSE="* -@EULA"
CBUILD="x86_64-pc-linux-gnu"
CFLAGS="-O2 -pipe"
CHOST="x86_64-pc-linux-gnu"
CONFIG_PROTECT="/etc"
CONFIG_PROTECT_MASK="/etc/ca-certificates.conf /etc/env.d /etc/gconf /etc/gentoo-release /etc/sandbox.d /etc/terminfo"
CXXFLAGS="-O2 -pipe"
DISTDIR="/usr/portage/distfiles"
FCFLAGS="-O2 -pipe"
FEATURES="assume-digests binpkg-logs config-protect-if-modified distlocks ebuild-locks fixlafiles merge-sync news parallel-fetch preserve-libs protect-owned sandbox sfperms strict unknown-features-warn unmerge-logs unmerge-orphans userfetch userpriv usersandbox usersync xattr"
FFLAGS="-O2 -pipe"
GENTOO_MIRRORS="http://distfiles.gentoo.org"
LDFLAGS="-Wl,-O1 -Wl,--as-needed"
MAKEOPTS=""
PKGDIR="/usr/portage/packages"
PORTAGE_CONFIGROOT="/"
PORTAGE_RSYNC_OPTS="--recursive --links --safe-links --perms --times --omit-dir-times --compress --force --whole-file --delete --stats --human-readable --timeout=180 --exclude=/distfiles --exclude=/local --exclude=/packages --exclude=/.git"
PORTAGE_TMPDIR="/var/tmp"
USE="acl amd64 berkdb bindist bzip2 cli cracklib crypt cxx dri fortran gdbm iconv ipv6 mmx mmxext modules multilib ncurses nls nptl openmp pam pcre readline seccomp session sse sse2 ssl tcpd unicode xattr zlib" ABI_X86="64" ALSA_CARDS="ali5451 als4000 atiixp atiixp-modem bt87x ca0106 cmipci emu10k1x ens1370 ens1371 es1938 es1968 fm801 hda-intel intel8x0 intel8x0m maestro3 trident usb-audio via82xx via82xx-modem ymfpci" APACHE2_MODULES="authn_core authz_core socache_shmcb unixd actions alias auth_basic authn_alias authn_anon authn_dbm authn_default authn_file authz_dbm authz_default authz_groupfile authz_host authz_owner authz_user autoindex cache cgi cgid dav dav_fs dav_lock deflate dir disk_cache env expires ext_filter file_cache filter headers include info log_config logio mem_cache mime mime_magic negotiation rewrite setenvif speling status unique_id userdir usertrack vhost_alias" CALLIGRA_FEATURES="kexi words flow plan sheets stage tables krita karbon braindump author" CAMERAS="ptp2" COLLECTD_PLUGINS="df interface irq load memory rrdtool swap syslog" CPU_FLAGS_X86="mmx sse sse2" ELIBC="glibc" GPSD_PROTOCOLS="ashtech aivdm earthmate evermore fv18 garmin garmintxt gpsclock itrax mtk3301 nmea ntrip navcom oceanserver oldstyle oncore rtcm104v2 rtcm104v3 sirf superstar2 timing tsip tripmate tnt ublox ubx" INPUT_DEVICES="keyboard mouse evdev" KERNEL="linux" LCD_DEVICES="bayrad cfontz cfontz633 glk hd44780 lb216 lcdm001 mtxorb ncurses text" LIBREOFFICE_EXTENSIONS="presenter-console presenter-minimizer" OFFICE_IMPLEMENTATION="libreoffice" PHP_TARGETS="php5-6" PYTHON_SINGLE_TARGET="python2_7" PYTHON_TARGETS="python2_7 python3_4" RUBY_TARGETS="ruby20 ruby21" USERLAND="GNU" VIDEO_CARDS="amdgpu fbdev intel nouveau radeon radeonsi vesa dummy v4l" XTABLES_ADDONS="quota2 psd pknock lscan length2 ipv4options ipset ipp2p iface geoip fuzzy condition tee tarpit sysrq steal rawnat logmark ipmark dhcpmac delude chaos account"
Unset:  CC, CPPFLAGS, CTARGET, CXX, EMERGE_DEFAULT_OPTS, INSTALL_MASK, LANG, LC_ALL, PORTAGE_BUNZIP2_COMMAND, PORTAGE_COMPRESS, PORTAGE_COMPRESS_FLAGS, PORTAGE_RSYNC_EXTRA_OPTS, USE_PYTHON

=================================================================
                        Package Settings
=================================================================

dev-libs/cloog-0.18.4::gentoo was built with the following:
USE="-static-libs" ABI_X86="64 -32 -x32"

localhost ~ # emerge -pqv '=dev-libs/cloog-0.18.4::gentoo'
[ebuild   R   ] dev-libs/cloog-0.18.4  USE="-static-libs" ABI_X86="(64) -32 (-x32)" 

 * IMPORTANT: 10 news items need reading for repository 'gentoo'.
 * Use eselect news read to view new items.
Comment 4 Tomáš Mózes 2016-09-26 07:41:03 UTC
*** Bug 595130 has been marked as a duplicate of this bug. ***