Gentoo Websites Logo
Go to: Gentoo Home Documentation Forums Lists Bugs Planet Store Wiki Get Gentoo!
Bug 569064 - sys-devel/automake-1.15-r1 and sys-devel/gcc[gcj]: test t/gcj4.sh fails
Summary: sys-devel/automake-1.15-r1 and sys-devel/gcc[gcj]: test t/gcj4.sh fails
Status: UNCONFIRMED
Alias: None
Product: Gentoo Linux
Classification: Unclassified
Component: [OLD] Development (show other bugs)
Hardware: All Linux
: Normal normal with 1 vote (vote)
Assignee: Gentoo's Team for Core System packages
URL:
Whiteboard:
Keywords: TESTFAILURE
Depends on:
Blocks:
 
Reported: 2015-12-21 21:06 UTC by eroen
Modified: 2017-01-18 09:37 UTC (History)
0 users

See Also:
Package list:
Runtime testing required: ---


Attachments
build.log (build.log,187.96 KB, text/plain)
2015-12-21 21:06 UTC, eroen
Details
test-suite.log.xz (test-suite.log.xz,53.78 KB, application/x-xz)
2015-12-21 21:09 UTC, eroen
Details

Note You need to log in before you can comment on or make changes to this bug.
Description eroen 2015-12-21 21:06:33 UTC
Created attachment 420086 [details]
build.log

This test is skipped unless sys-devel/gcc[gcj] is installed.

t/instmany-python.sh also fails, see bug 483358.


FAIL: t/gcj4.sh
...
FAIL: t/instmany-python.sh
...
PASS: contrib/t/multilib.sh
============================================================================
Testsuite summary for GNU Automake 1.15
============================================================================
# TOTAL: 2899
# PASS:  2734
# SKIP:  121
# XFAIL: 42
# FAIL:  2
# XPASS: 0
# ERROR: 0
============================================================================
See ./test-suite.log
Please report to bug-automake@gnu.org
============================================================================
Makefile:3026: recipe for target 'test-suite.log' failed
make[2]: *** [test-suite.log] Error 1
make[2]: Leaving directory '/var/tmp/portage/sys-devel/automake-1.15-r1/work/automake-1.15'
Makefile:3132: recipe for target 'check-TESTS' failed
make[1]: *** [check-TESTS] Error 2
make[1]: Leaving directory '/var/tmp/portage/sys-devel/automake-1.15-r1/work/automake-1.15'
Makefile:3366: recipe for target 'check-am' failed
make: *** [check-am] Error 2
 * ERROR: sys-devel/automake-1.15-r1::gentoo failed (test phase):
 *   emake failed
Comment 1 eroen 2015-12-21 21:09:28 UTC
Created attachment 420088 [details]
test-suite.log.xz

FAIL: t/gcj4
============

Running from installcheck: no
Test Protocol: none
PATH = /var/tmp/portage/sys-devel/automake-1.15-r1/work/automake-1.15/t/wrap:/var/tmp/portage/sys-devel/automake-1.15-r1/work/automake-1.15/t/ax:/usr/lib/portage/python3.4/ebuild-helpers/xattr:/usr/lib/portage/python3.4/ebuild-helpers:/usr/local/sbin:/usr/local/bin:/usr/sbin:/usr/bin:/sbin:/bin:/opt/bin:/usr/x86_64-pc-linux-gnu/gcc-bin/4.9.3
++ pwd
/var/tmp/portage/sys-devel/automake-1.15-r1/work/automake-1.15/t/gcj4.dir
+ cat
+ cat
+ aclocal-1.15 -Werror
+ autoconf
+ automake-1.15 --foreign -Werror -Wall
+ ./configure
+ cat stdout
checking for a BSD-compatible install... /usr/lib/portage/python3.4/ebuild-helpers/xattr/install -c
checking whether build environment is sane... yes
checking for a thread-safe mkdir -p... /bin/mkdir -p
checking for gawk... gawk
checking whether make sets $(MAKE)... yes
checking whether make supports nested variables... yes
checking for style of include used by make... GNU
checking for x86_64-pc-linux-gnu-gcj... x86_64-pc-linux-gnu-gcj
checking dependency style of x86_64-pc-linux-gnu-gcj... gcc3
checking that generated files are newer than configure... done
configure: creating ./config.status
config.status: creating Makefile
config.status: executing depfiles commands
+ grep 'dependency style of gcj' stdout
+ am_exit_trap 1
+ exit_status=1
+ set +e
+ cd /var/tmp/portage/sys-devel/automake-1.15-r1/work/automake-1.15
+ test none = tap
+ case $am_explicit_skips in
+ test 1 -eq 0
+ keep_testdirs=yes
+ am_keeping_testdirs
+ case $keep_testdirs in
+ return 0
+ set +x
FAIL t/gcj4.sh (exit status: 1)
Comment 2 eroen 2015-12-21 21:11:34 UTC
localhost ~ # emerge --info '=sys-devel/automake-1.15-r1::gentoo'
Portage 2.2.24 (python 3.4.3-final-0, hardened/linux/amd64, gcc-4.9.3, glibc-2.21-r1, 4.1.7-hardened-r1 x86_64)
=================================================================
                         System Settings
=================================================================
System uname: Linux-4.1.7-hardened-r1-x86_64-Intel-R-_Core-TM-_i5-2520M_CPU_@_2.50GHz-with-gentoo-2.2
KiB Mem:     1874040 total,   1225816 free
KiB Swap:          0 total,         0 free
sh bash 4.3_p39
ld GNU ld (Gentoo 2.25.1 p1.1) 2.25.1
app-shells/bash:          4.3_p39::gentoo
dev-lang/perl:            5.20.2::gentoo
dev-lang/python:          2.7.10-r1::gentoo, 3.4.3::gentoo
dev-util/pkgconfig:       0.28-r2::gentoo
sys-apps/baselayout:      2.2::gentoo
sys-apps/openrc:          0.18.4::gentoo
sys-apps/sandbox:         2.6-r1::gentoo
sys-devel/autoconf:       2.69::gentoo
sys-devel/automake:       1.14.1::gentoo, 1.15::gentoo
sys-devel/binutils:       2.25.1-r1::gentoo
sys-devel/gcc:            4.9.3::gentoo
sys-devel/gcc-config:     1.7.3::gentoo
sys-devel/libtool:        2.4.6::gentoo
sys-devel/make:           4.1-r1::gentoo
sys-kernel/linux-headers: 3.18::gentoo (virtual/os-headers)
sys-libs/glibc:           2.21-r1::gentoo
Repositories:

gentoo
    location: /usr/portage
    sync-type: rsync
    sync-uri: rsync://rsync.gentoo.org/gentoo-portage
    priority: -1000

ACCEPT_KEYWORDS="amd64"
ACCEPT_LICENSE="* -@EULA"
CBUILD="x86_64-pc-linux-gnu"
CFLAGS="-O2 -pipe"
CHOST="x86_64-pc-linux-gnu"
CONFIG_PROTECT="/etc"
CONFIG_PROTECT_MASK="/etc/ca-certificates.conf /etc/env.d /etc/gconf /etc/gentoo-release /etc/sandbox.d /etc/terminfo"
CXXFLAGS="-O2 -pipe"
DISTDIR="/usr/portage/distfiles"
FCFLAGS="-O2 -pipe"
FEATURES="assume-digests binpkg-logs config-protect-if-modified distlocks ebuild-locks fixlafiles merge-sync news parallel-fetch preserve-libs protect-owned sandbox sfperms strict unknown-features-warn unmerge-logs unmerge-orphans userfetch userpriv usersandbox usersync xattr"
FFLAGS="-O2 -pipe"
GENTOO_MIRRORS="http://distfiles.gentoo.org"
LDFLAGS="-Wl,-O1 -Wl,--as-needed"
PKGDIR="/usr/portage/packages"
PORTAGE_CONFIGROOT="/"
PORTAGE_RSYNC_OPTS="--recursive --links --safe-links --perms --times --omit-dir-times --compress --force --whole-file --delete --stats --human-readable --timeout=180 --exclude=/distfiles --exclude=/local --exclude=/packages"
PORTAGE_TMPDIR="/var/tmp"
USE="acl amd64 berkdb bindist bzip2 cli cracklib crypt cxx dri gdbm hardened iconv ipv6 justify mmx mmxext modules multilib ncurses nls nptl openmp pam pax_kernel pcre pie readline seccomp session sse sse2 ssl ssp tcpd unicode urandom xattr xtpax zlib" ABI_X86="64" ALSA_CARDS="ali5451 als4000 atiixp atiixp-modem bt87x ca0106 cmipci emu10k1x ens1370 ens1371 es1938 es1968 fm801 hda-intel intel8x0 intel8x0m maestro3 trident usb-audio via82xx via82xx-modem ymfpci" APACHE2_MODULES="authn_core authz_core socache_shmcb unixd actions alias auth_basic authn_alias authn_anon authn_dbm authn_default authn_file authz_dbm authz_default authz_groupfile authz_host authz_owner authz_user autoindex cache cgi cgid dav dav_fs dav_lock deflate dir disk_cache env expires ext_filter file_cache filter headers include info log_config logio mem_cache mime mime_magic negotiation rewrite setenvif speling status unique_id userdir usertrack vhost_alias" CALLIGRA_FEATURES="kexi words flow plan sheets stage tables krita karbon braindump author" CAMERAS="ptp2" COLLECTD_PLUGINS="df interface irq load memory rrdtool swap syslog" CPU_FLAGS_X86="mmx mmxext sse sse2" ELIBC="glibc" GPSD_PROTOCOLS="ashtech aivdm earthmate evermore fv18 garmin garmintxt gpsclock itrax mtk3301 nmea ntrip navcom oceanserver oldstyle oncore rtcm104v2 rtcm104v3 sirf superstar2 timing tsip tripmate tnt ublox ubx" INPUT_DEVICES="keyboard mouse evdev" KERNEL="linux" LCD_DEVICES="bayrad cfontz cfontz633 glk hd44780 lb216 lcdm001 mtxorb ncurses text" LIBREOFFICE_EXTENSIONS="presenter-console presenter-minimizer" OFFICE_IMPLEMENTATION="libreoffice" PHP_TARGETS="php5-5" PYTHON_SINGLE_TARGET="python2_7" PYTHON_TARGETS="python2_7 python3_4" RUBY_TARGETS="ruby20 ruby21" USERLAND="GNU" VIDEO_CARDS="fbdev glint intel mach64 mga nouveau nv r128 radeon savage sis tdfx trident vesa via vmware dummy v4l" XTABLES_ADDONS="quota2 psd pknock lscan length2 ipv4options ipset ipp2p iface geoip fuzzy condition tee tarpit sysrq steal rawnat logmark ipmark dhcpmac delude chaos account"
Unset:  CC, CPPFLAGS, CTARGET, CXX, EMERGE_DEFAULT_OPTS, INSTALL_MASK, LANG, LC_ALL, MAKEOPTS, PORTAGE_BUNZIP2_COMMAND, PORTAGE_COMPRESS, PORTAGE_COMPRESS_FLAGS, PORTAGE_RSYNC_EXTRA_OPTS, USE_PYTHON

localhost ~ # emerge -pqv '=sys-devel/automake-1.15-r1::gentoo'
[ebuild     U ] sys-devel/automake-1.15-r1 [1.15]

 * IMPORTANT: 10 news items need reading for repository 'gentoo'.
 * Use eselect news read to view new items.