Gentoo Websites Logo
Go to: Gentoo Home Documentation Forums Lists Bugs Planet Store Wiki Get Gentoo!
Bug 467442 - dev-tcltk/ck-8.0-r3 fails to build with tcl/tk-8.6
Summary: dev-tcltk/ck-8.0-r3 fails to build with tcl/tk-8.6
Status: RESOLVED FIXED
Alias: None
Product: Gentoo Linux
Classification: Unclassified
Component: New packages (show other bugs)
Hardware: All Linux
: Normal normal (vote)
Assignee: TCL/TK Project
URL:
Whiteboard:
Keywords:
Depends on:
Blocks: tcltk-8.6
  Show dependency tree
 
Reported: 2013-04-27 06:39 UTC by Patrick Lauer
Modified: 2013-04-27 16:26 UTC (History)
0 users

See Also:
Package list:
Runtime testing required: ---


Attachments

Note You need to log in before you can comment on or make changes to this bug.
Description Patrick Lauer gentoo-dev 2013-04-27 06:39:28 UTC
>>> Source configured.
>>> Compiling source in /var/tmp/portage/dev-tcltk/ck-8.0-r3/work/ck8.0 ...
make -j4 
x86_64-pc-linux-gnu-gcc -c -O2 -pipe -DUSE_NON_CONST -fPIC -I. -I/usr/include -I/usr/include/ncursesw -D_XOPEN_SOURCE_EXTENDED -DUSE_NCURSES -DUSE_NCURSESW -DHAVE_UNISTD_H=1 -DHAVE_LIMITS_H=1 -DSTDC_HEADERS=1 -DRETSIGTYPE=void -DHAVE_SIGACTION=1 -DHAVE_SCR_DUMP=1 -DHAVE_GPM=1 -DTK_FILE_READ_PTR=1    -DCK_LIBRARY=\"/usr/lib/ck8.6\" ckAppInit.c
x86_64-pc-linux-gnu-gcc -c -O2 -pipe -DUSE_NON_CONST -fPIC -I. -I/usr/include -I/usr/include/ncursesw -D_XOPEN_SOURCE_EXTENDED -DUSE_NCURSES -DUSE_NCURSESW -DHAVE_UNISTD_H=1 -DHAVE_LIMITS_H=1 -DSTDC_HEADERS=1 -DRETSIGTYPE=void -DHAVE_SIGACTION=1 -DHAVE_SCR_DUMP=1 -DHAVE_GPM=1 -DTK_FILE_READ_PTR=1    -DCK_LIBRARY=\"/usr/lib/ck8.6\" ckBind.c
x86_64-pc-linux-gnu-gcc -c -O2 -pipe -DUSE_NON_CONST -fPIC -I. -I/usr/include -I/usr/include/ncursesw -D_XOPEN_SOURCE_EXTENDED -DUSE_NCURSES -DUSE_NCURSESW -DHAVE_UNISTD_H=1 -DHAVE_LIMITS_H=1 -DSTDC_HEADERS=1 -DRETSIGTYPE=void -DHAVE_SIGACTION=1 -DHAVE_SCR_DUMP=1 -DHAVE_GPM=1 -DTK_FILE_READ_PTR=1    -DCK_LIBRARY=\"/usr/lib/ck8.6\" ckBorder.c
x86_64-pc-linux-gnu-gcc -c -O2 -pipe -DUSE_NON_CONST -fPIC -I. -I/usr/include -I/usr/include/ncursesw -D_XOPEN_SOURCE_EXTENDED -DUSE_NCURSES -DUSE_NCURSESW -DHAVE_UNISTD_H=1 -DHAVE_LIMITS_H=1 -DSTDC_HEADERS=1 -DRETSIGTYPE=void -DHAVE_SIGACTION=1 -DHAVE_SCR_DUMP=1 -DHAVE_GPM=1 -DTK_FILE_READ_PTR=1    -DCK_LIBRARY=\"/usr/lib/ck8.6\" ckCmds.c
In file included from ckPort.h:77:0,
                 from ckBind.c:15:
ckBind.c: In function ‘Ck_CreateBindingTable’:
ckBind.c:236:50: warning: cast to pointer from integer of different size [-Wint-to-pointer-cast]
      hPtr = Tcl_CreateHashEntry(&revKeySymTable, (char *) kPtr->value,
                                                  ^
ckBind.c: In function ‘FindSequence’:
ckBind.c:973:21: error: ‘Tcl_Interp’ has no member named ‘result’
       sprintf(interp->result,
                     ^
ckBind.c:1061:12: error: ‘Tcl_Interp’ has no member named ‘result’
      interp->result = "no event type or keysym";
            ^
ckBorder.c: In function ‘Ck_GetGChar’:
ckBorder.c:107:11: warning: cast from pointer to integer of different size [-Wpointer-to-int-cast]
  *gchar = (int) Tcl_GetHashValue(hPtr);
           ^
ckBind.c:1069:12: error: ‘Tcl_Interp’ has no member named ‘result’
      interp->result = "missing \">\" in binding";
            ^
ckBind.c:1084:8: error: ‘Tcl_Interp’ has no member named ‘result’
  interp->result = "no events specified in binding";
        ^
In file included from ckPort.h:77:0,
                 from ckBorder.c:12:
ckBorder.c: In function ‘Ck_SetGChar’:
ckBorder.c:136:28: warning: cast to pointer from integer of different size [-Wint-to-pointer-cast]
     Tcl_SetHashValue(hPtr, (ClientData) gchar);
                            ^
In file included from ckPort.h:77:0,
                 from ckBind.c:15:
ckBind.c: In function ‘CkKeysymToString’:
ckBind.c:1542:47: warning: cast to pointer from integer of different size [-Wint-to-pointer-cast]
     hPtr = Tcl_FindHashEntry(&revKeySymTable, (char *) keySym);
                                               ^
ckBind.c: In function ‘CkTermHasKey’:
ckBind.c:1587:8: error: ‘Tcl_Interp’ has no member named ‘result’
  interp->result = "1";
        ^
ckBind.c:1600:12: error: ‘Tcl_Interp’ has no member named ‘result’
      interp->result = "1";
            ^
ckBind.c:1602:12: error: ‘Tcl_Interp’ has no member named ‘result’
      interp->result = "0";
            ^
ckBind.c:1607:12: error: ‘Tcl_Interp’ has no member named ‘result’
      interp->result = "1";
            ^
In file included from ckPort.h:77:0,
                 from ckBind.c:15:
ckBind.c:1610:44: warning: cast to pointer from integer of different size [-Wint-to-pointer-cast]
  hPtr = Tcl_FindHashEntry(&revKeySymTable, (char *)
                                            ^
make: *** [ckBind.o] Error 1
make: *** Waiting for unfinished jobs....
ckCmds.c: In function ‘Ck_CursesCmd’:
ckCmds.c:393:20: error: ‘Tcl_Interp’ has no member named ‘result’
      sprintf(interp->result, "%d", gchar);
                    ^
ckCmds.c:447:12: error: ‘Tcl_Interp’ has no member named ‘result’
      interp->result = (mainPtr->flags & CK_REVERSE_KLUDGE) ?
            ^
ckCmds.c:479:12: error: ‘Tcl_Interp’ has no member named ‘result’
      interp->result = "screen dump failed";
            ^
ckCmds.c: In function ‘Ck_WinfoCmd’:
ckCmds.c:581:12: error: ‘Tcl_Interp’ has no member named ‘result’
      interp->result = winPtr->pathName;
            ^
ckCmds.c:585:8: error: ‘Tcl_Interp’ has no member named ‘result’
  interp->result = (winPtr->mainPtr->flags & CK_HAS_COLOR) ? "3" : "1";
        ^
ckCmds.c:592:12: error: ‘Tcl_Interp’ has no member named ‘result’
      interp->result = "0";
            ^
ckCmds.c:594:12: error: ‘Tcl_Interp’ has no member named ‘result’
      interp->result = "1";
            ^
ckCmds.c:598:16: error: ‘Tcl_Interp’ has no member named ‘result’
  sprintf(interp->result, "%dx%d+%d+%d", winPtr->width,
                ^
ckCmds.c:602:16: error: ‘Tcl_Interp’ has no member named ‘result’
  sprintf(interp->result, "%d", winPtr->height);
                ^
ckCmds.c:606:8: error: ‘Tcl_Interp’ has no member named ‘result’
  interp->result = (winPtr->flags & CK_MAPPED) ? "1" : "0";
        ^
ckCmds.c:610:12: error: ‘Tcl_Interp’ has no member named ‘result’
      interp->result = winPtr->geomMgrPtr->name;
            ^
ckCmds.c:613:8: error: ‘Tcl_Interp’ has no member named ‘result’
  interp->result = (char *) winPtr->nameUid;
        ^
ckCmds.c:616:8: error: ‘Tcl_Interp’ has no member named ‘result’
  interp->result = (char *) winPtr->classUid;
        ^
ckCmds.c:620:12: error: ‘Tcl_Interp’ has no member named ‘result’
      interp->result = winPtr->parentPtr->pathName;
            ^
ckCmds.c:624:16: error: ‘Tcl_Interp’ has no member named ‘result’
  sprintf(interp->result, "%d", winPtr->reqHeight);
                ^
ckCmds.c:628:16: error: ‘Tcl_Interp’ has no member named ‘result’
  sprintf(interp->result, "%d", winPtr->reqWidth);
                ^
ckCmds.c:635:16: error: ‘Tcl_Interp’ has no member named ‘result’
  sprintf(interp->result, "%d", x);
                ^
ckCmds.c:642:16: error: ‘Tcl_Interp’ has no member named ‘result’
  sprintf(interp->result, "%d", y);
                ^
ckCmds.c:646:16: error: ‘Tcl_Interp’ has no member named ‘result’
  sprintf(interp->result, "%d", winPtr->mainPtr->winPtr->height);
                ^
ckCmds.c:650:16: error: ‘Tcl_Interp’ has no member named ‘result’
  sprintf(interp->result, "%d", winPtr->mainPtr->winPtr->width);
                ^
ckCmds.c:655:9: error: ‘Tcl_Interp’ has no member named ‘result’
   interp->result = winPtr->pathName;
         ^
ckCmds.c:661:16: error: ‘Tcl_Interp’ has no member named ‘result’
  sprintf(interp->result, "%d", winPtr->width);
                ^
ckCmds.c:664:16: error: ‘Tcl_Interp’ has no member named ‘result’
  sprintf(interp->result, "%d", winPtr->x);
                ^
ckCmds.c:667:16: error: ‘Tcl_Interp’ has no member named ‘result’
  sprintf(interp->result, "%d", winPtr->y);
                ^
ckCmds.c: In function ‘Ck_BindCmd’:
ckCmds.c:754:8: error: ‘Tcl_Interp’ has no member named ‘result’
  interp->result = command;
        ^
make: *** [ckCmds.o] Error 1
 * ERROR: dev-tcltk/ck-8.0-r3 failed (compile phase):
 *   emake failed
Comment 1 Patrick Lauer gentoo-dev 2013-04-27 06:39:42 UTC
Portage 2.1.11.62 (default/linux/amd64/13.0, gcc-4.8.0, glibc-2.17, 3.8.10-gentoo x86_64)
=================================================================
System uname: Linux-3.8.10-gentoo-x86_64-AMD_Phenom-tm-_II_X4_965_Processor-with-gentoo-2.2
KiB Mem:     7921068 total,    539692 free
KiB Swap:   25165812 total,  25143708 free
Timestamp of tree: Unknown
ld GNU ld (GNU Binutils) 2.23.1
app-shells/bash:          4.2_p45
dev-java/java-config:     2.2.0
dev-lang/python:          2.7.3-r3, 3.2.3-r2
dev-util/cmake:           2.8.10.2-r2
dev-util/pkgconfig:       0.28
sys-apps/baselayout:      2.2
sys-apps/openrc:          0.11.8
sys-apps/sandbox:         2.6-r1
sys-devel/autoconf:       2.13, 2.69
sys-devel/automake:       1.11.6, 1.12.6, 1.13.1
sys-devel/binutils:       2.23.1
sys-devel/gcc:            4.8.0
sys-devel/gcc-config:     1.8
sys-devel/libtool:        2.4.2
sys-devel/make:           3.82-r4
sys-kernel/linux-headers: 3.8 (virtual/os-headers)
sys-libs/glibc:           2.17
Repositories: gentoo
ACCEPT_KEYWORDS="amd64 ~amd64"
ACCEPT_LICENSE="*"
CBUILD="x86_64-pc-linux-gnu"
CFLAGS="-O2 -pipe"
CHOST="x86_64-pc-linux-gnu"
CONFIG_PROTECT="/etc /usr/share/config /usr/share/gnupg/qualified.txt /usr/share/polkit-1/actions /usr/share/themes/oxygen-gtk/gtk-2.0 /var/lib/hsqldb"
CONFIG_PROTECT_MASK="${EPREFIX}/etc/gconf /etc/ca-certificates.conf /etc/env.d /etc/fonts/fonts.conf /etc/gconf /etc/gentoo-release /etc/revdep-rebuild /etc/sandbox.d /etc/terminfo"
CXXFLAGS="-O2 -pipe"
DISTDIR="/usr/portage/distfiles"
FCFLAGS="-O2 -pipe"
FEATURES="assume-digests binpkg-logs buildpkg config-protect-if-modified distlocks ebuild-locks fixlafiles merge-sync news parallel-fetch protect-owned sandbox sfperms strict test unknown-features-warn unmerge-logs unmerge-orphans userfetch"
FFLAGS="-O2 -pipe"
GENTOO_MIRRORS="ftp://ftp.lecl.net/pub/gentoo/ http://ftp.lecl.net/pub/gentoo/"
LANG="en_US.utf8"
LDFLAGS="-Wl,-O1 -Wl,--as-needed"
MAKEOPTS="-j4"
PKGDIR="/usr/portage/packages"
PORTAGE_CONFIGROOT="/"
PORTAGE_RSYNC_OPTS="--recursive --links --safe-links --perms --times --compress --force --whole-file --delete --stats --human-readable --timeout=180 --exclude=/distfiles --exclude=/local --exclude=/packages"
PORTAGE_TMPDIR="/var/tmp"
PORTDIR="/usr/portage"
PORTDIR_OVERLAY=""
SYNC="rsync://rsync.gentoo.org/gentoo-portage"
USE="acl amd64 berkdb bzip2 cli cracklib crypt cxx dri egl fortran gdbm gpm iconv ipv6 mmx modules mudflap multilib ncurses nls nptl openmp openvg pam pcre readline session sqlite sse sse2 ssl tcpd unicode xa xvfb zlib" ABI_X86="64" ALSA_CARDS="ali5451 als4000 atiixp atiixp-modem bt87x ca0106 cmipci emu10k1x ens1370 ens1371 es1938 es1968 fm801 hda-intel intel8x0 intel8x0m maestro3 trident usb-audio via82xx via82xx-modem ymfpci" ALSA_PCM_PLUGINS="adpcm alaw asym copy dmix dshare dsnoop empty extplug file hooks iec958 ioplug ladspa lfloat linear meter mmap_emul mulaw multi null plug rate route share shm softvol" APACHE2_MODULES="authn_core authz_core socache_shmcb unixd actions alias auth_basic authn_alias authn_anon authn_dbm authn_default authn_file authz_dbm authz_default authz_groupfile authz_host authz_owner authz_user autoindex cache cgi cgid dav dav_fs dav_lock deflate dir disk_cache env expires ext_filter file_cache filter headers include info log_config logio mem_cache mime mime_magic negotiation rewrite setenvif speling status unique_id userdir usertrack vhost_alias" CALLIGRA_FEATURES="kexi words flow plan sheets stage tables krita karbon braindump" CAMERAS="ptp2" COLLECTD_PLUGINS="df interface irq load memory rrdtool swap syslog" ELIBC="glibc" GPSD_PROTOCOLS="ashtech aivdm earthmate evermore fv18 garmin garmintxt gpsclock itrax mtk3301 nmea ntrip navcom oceanserver oldstyle oncore rtcm104v2 rtcm104v3 sirf superstar2 timing tsip tripmate tnt ubx" INPUT_DEVICES="keyboard mouse evdev" KERNEL="linux" LCD_DEVICES="bayrad cfontz cfontz633 glk hd44780 lb216 lcdm001 mtxorb ncurses text" LIBREOFFICE_EXTENSIONS="presenter-console presenter-minimizer" OFFICE_IMPLEMENTATION="libreoffice" PHP_TARGETS="php5-3" PYTHON_SINGLE_TARGET="python2_7" PYTHON_TARGETS="python2_7 python3_2" RUBY_TARGETS="ruby19" USERLAND="GNU" VIDEO_CARDS="vesa" XTABLES_ADDONS="quota2 psd pknock lscan length2 ipv4options ipset ipp2p iface geoip fuzzy condition tee tarpit sysrq steal rawnat logmark ipmark dhcpmac delude chaos account"
Unset:  CPPFLAGS, CTARGET, EMERGE_DEFAULT_OPTS, INSTALL_MASK, LC_ALL, PORTAGE_BUNZIP2_COMMAND, PORTAGE_COMPRESS, PORTAGE_COMPRESS_FLAGS, PORTAGE_RSYNC_EXTRA_OPTS, USE_PYTHON
Comment 2 Justin Lecher gentoo-dev 2013-04-27 16:26:13 UTC
+*ck-8.0-r4 (27 Apr 2013)
+
+  27 Apr 2013; Justin Lecher <jlec@gentoo.org> +ck-8.0-r4.ebuild, metadata.xml:
+  Add fix for compatibility with tcl-8.6, #467442
+