Gentoo Websites Logo
Go to: Gentoo Home Documentation Forums Lists Bugs Planet Store Wiki Get Gentoo!
Bug 467156 - dev-scheme/guile-1.8.8-r1 fails tests - fatal: making test-suite.log: failed to create stack-limit-calibration.scm.trs
Summary: dev-scheme/guile-1.8.8-r1 fails tests - fatal: making test-suite.log: failed ...
Status: IN_PROGRESS
Alias: None
Product: Gentoo Linux
Classification: Unclassified
Component: Current packages (show other bugs)
Hardware: All Linux
: Normal normal (vote)
Assignee: Scheme Project
URL:
Whiteboard:
Keywords:
Depends on:
Blocks:
 
Reported: 2013-04-25 05:59 UTC by Patrick Lauer
Modified: 2018-02-12 19:28 UTC (History)
8 users (show)

See Also:
Package list:
Runtime testing required: ---


Attachments
guile-1.8.8-at-least-_try_-to-test.patch (guile-1.8.8-at-least-_try_-to-test.patch,1.05 KB, patch)
2014-01-26 14:37 UTC, Greg Turner
Details | Diff

Note You need to log in before you can comment on or make changes to this bug.
Description Patrick Lauer gentoo-dev 2013-04-25 05:59:21 UTC
>>> Test phase [check]: dev-scheme/guile-1.8.8-r1
Making check in oop
make[1]: Entering directory `/var/tmp/portage/dev-scheme/guile-1.8.8-r1/work/guile-1.8.8/oop'
Making check in goops
make[2]: Entering directory `/var/tmp/portage/dev-scheme/guile-1.8.8-r1/work/guile-1.8.8/oop/goops'
make[2]: Nothing to be done for `check'.
make[2]: Leaving directory `/var/tmp/portage/dev-scheme/guile-1.8.8-r1/work/guile-1.8.8/oop/goops'
make[2]: Entering directory `/var/tmp/portage/dev-scheme/guile-1.8.8-r1/work/guile-1.8.8/oop'
make[2]: Nothing to be done for `check-am'.
make[2]: Leaving directory `/var/tmp/portage/dev-scheme/guile-1.8.8-r1/work/guile-1.8.8/oop'
make[1]: Leaving directory `/var/tmp/portage/dev-scheme/guile-1.8.8-r1/work/guile-1.8.8/oop'
Making check in libguile
make[1]: Entering directory `/var/tmp/portage/dev-scheme/guile-1.8.8-r1/work/guile-1.8.8/libguile'
make  check-am
make[2]: Entering directory `/var/tmp/portage/dev-scheme/guile-1.8.8-r1/work/guile-1.8.8/libguile'
make  check-TESTS
make[3]: Entering directory `/var/tmp/portage/dev-scheme/guile-1.8.8-r1/work/guile-1.8.8/libguile'
make[4]: Entering directory `/var/tmp/portage/dev-scheme/guile-1.8.8-r1/work/guile-1.8.8/libguile'
/var/tmp/portage/dev-scheme/guile-1.8.8-r1/work/guile-1.8.8/pre-inst-guile -s ./measure-hwm.scm > stack-limit-calibration.scm
make[5]: Entering directory `/var/tmp/portage/dev-scheme/guile-1.8.8-r1/work/guile-1.8.8/libguile'
make[5]: Leaving directory `/var/tmp/portage/dev-scheme/guile-1.8.8-r1/work/guile-1.8.8/libguile'
fatal: making test-suite.log: failed to create stack-limit-calibration.scm.trs
fatal: making test-suite.log: failed to create stack-limit-calibration.scm.log
make[4]: *** [test-suite.log] Error 1
make[4]: Leaving directory `/var/tmp/portage/dev-scheme/guile-1.8.8-r1/work/guile-1.8.8/libguile'
make[3]: *** [check-TESTS] Error 2
make[3]: Leaving directory `/var/tmp/portage/dev-scheme/guile-1.8.8-r1/work/guile-1.8.8/libguile'
make[2]: *** [check-am] Error 2
make[2]: Leaving directory `/var/tmp/portage/dev-scheme/guile-1.8.8-r1/work/guile-1.8.8/libguile'
make[1]: *** [check] Error 2
make[1]: Leaving directory `/var/tmp/portage/dev-scheme/guile-1.8.8-r1/work/guile-1.8.8/libguile'
make: *** [check-recursive] Error 1
 * ERROR: dev-scheme/guile-1.8.8-r1 failed (test phase):
 *   Make check failed. See above for details.

Portage 2.1.11.62 (default/linux/amd64/13.0, gcc-4.8.0, glibc-2.17, 3.8.5-gentoo x86_64)
=================================================================
System uname: Linux-3.8.5-gentoo-x86_64-AMD_Phenom-tm-_II_X4_965_Processor-with-gentoo-2.2
KiB Mem:     7921068 total,   2195376 free
KiB Swap:   25165812 total,  25160700 free
Timestamp of tree: Unknown
ld GNU ld (GNU Binutils) 2.23.1
app-shells/bash:          4.2_p45
dev-lang/python:          2.7.3-r3, 3.2.3-r2
dev-util/cmake:           2.8.10.2-r2
dev-util/pkgconfig:       0.28
sys-apps/baselayout:      2.2
sys-apps/openrc:          0.11.8
sys-apps/sandbox:         2.6-r1
sys-devel/autoconf:       2.13, 2.69
sys-devel/automake:       1.10.3, 1.11.6, 1.12.6, 1.13.1
sys-devel/binutils:       2.23.1
sys-devel/gcc:            4.6.4, 4.8.0
sys-devel/gcc-config:     1.8
sys-devel/libtool:        2.4.2
sys-devel/make:           3.82-r4
sys-kernel/linux-headers: 3.8 (virtual/os-headers)
sys-libs/glibc:           2.17
Repositories: gentoo
ACCEPT_KEYWORDS="amd64 ~amd64"
ACCEPT_LICENSE="*"
CBUILD="x86_64-pc-linux-gnu"
CFLAGS="-O2 -pipe"
CHOST="x86_64-pc-linux-gnu"
CONFIG_PROTECT="/etc /usr/share/config /usr/share/gnupg/qualified.txt /usr/share/polkit-1/actions /usr/share/themes/oxygen-gtk/gtk-2.0 /var/lib/hsqldb"
CONFIG_PROTECT_MASK="${EPREFIX}/etc/gconf /etc/ca-certificates.conf /etc/env.d /etc/fonts/fonts.conf /etc/gconf /etc/gentoo-release /etc/revdep-rebuild /etc/sandbox.d /etc/terminfo /etc/texmf/language.dat.d /etc/texmf/language.def.d /etc/texmf/updmap.d /etc/texmf/web2c"
CXXFLAGS="-O2 -pipe"
DISTDIR="/usr/portage/distfiles"
FCFLAGS="-O2 -pipe"
FEATURES="assume-digests binpkg-logs buildpkg config-protect-if-modified distlocks ebuild-locks fixlafiles merge-sync news parallel-fetch protect-owned sandbox sfperms strict test unknown-features-warn unmerge-logs unmerge-orphans userfetch"
FFLAGS="-O2 -pipe"
GENTOO_MIRRORS="ftp://ftp.lecl.net/pub/gentoo/ http://ftp.lecl.net/pub/gentoo/"
LANG="en_US.utf8"
LDFLAGS="-Wl,-O1 -Wl,--as-needed"
MAKEOPTS="-j4"
PKGDIR="/usr/portage/packages"
PORTAGE_CONFIGROOT="/"
PORTAGE_RSYNC_OPTS="--recursive --links --safe-links --perms --times --compress --force --whole-file --delete --stats --human-readable --timeout=180 --exclude=/distfiles --exclude=/local --exclude=/packages"
PORTAGE_TMPDIR="/var/tmp"
PORTDIR="/usr/portage"
PORTDIR_OVERLAY=""
SYNC="rsync://rsync.gentoo.org/gentoo-portage"
USE="acl amd64 berkdb bzip2 cli cracklib crypt cxx dri egl fortran gdbm gpm iconv ipv6 mmx modules mudflap multilib ncurses nls nptl openmp openvg pam pcre readline session sqlite sse sse2 ssl tcpd unicode xa xvfb zlib" ABI_X86="64" ALSA_CARDS="ali5451 als4000 atiixp atiixp-modem bt87x ca0106 cmipci emu10k1x ens1370 ens1371 es1938 es1968 fm801 hda-intel intel8x0 intel8x0m maestro3 trident usb-audio via82xx via82xx-modem ymfpci" ALSA_PCM_PLUGINS="adpcm alaw asym copy dmix dshare dsnoop empty extplug file hooks iec958 ioplug ladspa lfloat linear meter mmap_emul mulaw multi null plug rate route share shm softvol" APACHE2_MODULES="authn_core authz_core socache_shmcb unixd actions alias auth_basic authn_alias authn_anon authn_dbm authn_default authn_file authz_dbm authz_default authz_groupfile authz_host authz_owner authz_user autoindex cache cgi cgid dav dav_fs dav_lock deflate dir disk_cache env expires ext_filter file_cache filter headers include info log_config logio mem_cache mime mime_magic negotiation rewrite setenvif speling status unique_id userdir usertrack vhost_alias" CALLIGRA_FEATURES="kexi words flow plan sheets stage tables krita karbon braindump" CAMERAS="ptp2" COLLECTD_PLUGINS="df interface irq load memory rrdtool swap syslog" ELIBC="glibc" GPSD_PROTOCOLS="ashtech aivdm earthmate evermore fv18 garmin garmintxt gpsclock itrax mtk3301 nmea ntrip navcom oceanserver oldstyle oncore rtcm104v2 rtcm104v3 sirf superstar2 timing tsip tripmate tnt ubx" INPUT_DEVICES="keyboard mouse evdev" KERNEL="linux" LCD_DEVICES="bayrad cfontz cfontz633 glk hd44780 lb216 lcdm001 mtxorb ncurses text" LIBREOFFICE_EXTENSIONS="presenter-console presenter-minimizer" OFFICE_IMPLEMENTATION="libreoffice" PHP_TARGETS="php5-3" PYTHON_SINGLE_TARGET="python2_7" PYTHON_TARGETS="python2_7 python3_2" RUBY_TARGETS="ruby19" USERLAND="GNU" VIDEO_CARDS="vesa" XTABLES_ADDONS="quota2 psd pknock lscan length2 ipv4options ipset ipp2p iface geoip fuzzy condition tee tarpit sysrq steal rawnat logmark ipmark dhcpmac delude chaos account"
Unset:  CPPFLAGS, CTARGET, EMERGE_DEFAULT_OPTS, INSTALL_MASK, LC_ALL, PORTAGE_BUNZIP2_COMMAND, PORTAGE_COMPRESS, PORTAGE_COMPRESS_FLAGS, PORTAGE_RSYNC_EXTRA_OPTS, USE_PYTHON
Comment 1 Panagiotis Christopoulos (RETIRED) gentoo-dev 2013-04-25 09:05:02 UTC
Yeah, failed too here on ~x86, but passed without issues on x86, have to do more testing.
Comment 2 Greg Turner 2014-01-26 14:37:43 UTC
Created attachment 368794 [details, diff]
guile-1.8.8-at-least-_try_-to-test.patch

The enclosed patch allows the automake machinery to function correctly on ~amd64 and ~x86.  However, the test suite still fails.  At least it's more colorful with this patch :)
Comment 3 Émeric Maschino 2015-02-07 17:18:38 UTC
Same problem here on ia64.

     Émeric