Gentoo Websites Logo
Go to: Gentoo Home Documentation Forums Lists Bugs Planet Store Wiki Get Gentoo!
Bug 466944 - gnome-base/gnome-vfs-2.24.4-r1 with automake-1.13 - error: using '$(srcdir)' in TESTS is currently broken: '$(srcdir)/auto-test'
Summary: gnome-base/gnome-vfs-2.24.4-r1 with automake-1.13 - error: using '$(srcdir)' ...
Status: RESOLVED FIXED
Alias: None
Product: Gentoo Linux
Classification: Unclassified
Component: [OLD] GNOME (show other bugs)
Hardware: All Linux
: Normal normal with 1 vote (vote)
Assignee: Gentoo Linux Gnome Desktop Team
URL: https://bugzilla.gnome.org/show_bug.c...
Whiteboard:
Keywords:
Depends on:
Blocks: automake-1.13
  Show dependency tree
 
Reported: 2013-04-23 23:57 UTC by iGentoo
Modified: 2013-05-05 12:00 UTC (History)
0 users

See Also:
Package list:
Runtime testing required: ---
zhchun.bei: Bugday?


Attachments
gnome-vfs-2.24.4-build.tar.xz (gnome-vfs-2.24.4-build.tar.xz,2.21 KB, application/x-xz-compressed-tar)
2013-04-23 23:57 UTC, iGentoo
Details

Note You need to log in before you can comment on or make changes to this bug.
Description iGentoo 2013-04-23 23:57:05 UTC
Created attachment 346430 [details]
gnome-vfs-2.24.4-build.tar.xz

***** aclocal *****
***** PWD: /var/tmp/portage/gnome-base/gnome-vfs-2.24.4-r1/work/gnome-vfs-2.24.4
***** aclocal

aclocal-1.13: warning: autoconf input should be named 'configure.ac', not 'configure.in'
configure.in:36: error: 'AM_CONFIG_HEADER': this macro is obsolete.
    You should use the 'AC_CONFIG_HEADERS' macro instead.
/usr/share/aclocal-1.13/obsolete-err.m4:12: AM_CONFIG_HEADER is expanded from...
configure.in:36: the top level
autom4te-2.69: /usr/bin/m4 failed with exit status: 1
aclocal-1.13: error: echo failed with exit status: 1



***** automake *****
***** PWD: /var/tmp/portage/gnome-base/gnome-vfs-2.24.4-r1/work/gnome-vfs-2.24.4
***** automake --add-missing --copy

automake-1.13: warning: autoconf input should be named 'configure.ac', not 'configure.in'
configure.in:424: warning: AC_LANG_CONFTEST: no AC_LANG_SOURCE call detected in body
../../lib/autoconf/lang.m4:193: AC_LANG_CONFTEST is expanded from...
../../lib/autoconf/general.m4:2590: _AC_COMPILE_IFELSE is expanded from...
../../lib/autoconf/general.m4:2606: AC_COMPILE_IFELSE is expanded from...
../../lib/m4sugar/m4sh.m4:639: AS_IF is expanded from...
../../lib/autoconf/general.m4:1462: AC_ARG_ENABLE is expanded from...
configure.in:424: the top level
configure.in:610: warning: AC_CACHE_VAL(openssl_libs, ...): suspicious cache-id, must contain _cv_ to be cached
../../lib/autoconf/general.m4:2031: AC_CACHE_VAL is expanded from...
../../lib/autoconf/general.m4:2052: AC_CACHE_CHECK is expanded from...
aclocal.m4:9848: PKG_CHECK_MODULES is expanded from...
configure.in:610: the top level
configure.in:813: warning: AC_LANG_CONFTEST: no AC_LANG_SOURCE call detected in body
../../lib/autoconf/lang.m4:193: AC_LANG_CONFTEST is expanded from...
../../lib/autoconf/general.m4:2661: _AC_LINK_IFELSE is expanded from...
../../lib/autoconf/general.m4:2678: AC_LINK_IFELSE is expanded from...
../../lib/m4sugar/m4sh.m4:639: AS_IF is expanded from...
../../lib/autoconf/general.m4:2661: _AC_LINK_IFELSE is expanded from...
../../lib/autoconf/general.m4:2678: AC_LINK_IFELSE is expanded from...
../../lib/autoconf/functions.m4:149: AC_TRY_LINK_FUNC is expanded from...
configure.in:813: the top level
configure.in:838: warning: AC_CACHE_VAL(have_res_ninit, ...): suspicious cache-id, must contain _cv_ to be cached
../../lib/autoconf/general.m4:2031: AC_CACHE_VAL is expanded from...
../../lib/autoconf/general.m4:2052: AC_CACHE_CHECK is expanded from...
configure.in:838: the top level
configure.in:37: warning: AM_INIT_AUTOMAKE: two- and three-arguments forms are deprecated.  For more info, see:
configure.in:37: http://www.gnu.org/software/automake/manual/automake.html#Modernize-AM_INIT_AUTOMAKE-invocation
automake-1.13: warning: autoconf input should be named 'configure.ac', not 'configure.in'
daemon/Makefile.am:42: warning: '%'-style pattern rules are a GNU make extension
daemon/Makefile.am:1: warning: 'INCLUDES' is the old name for 'AM_CPPFLAGS' (or '*_CPPFLAGS')
imported/neon/Makefile.am:9: warning: 'INCLUDES' is the old name for 'AM_CPPFLAGS' (or '*_CPPFLAGS')
libgnomevfs/Makefile.am:8: warning: 'INCLUDES' is the old name for 'AM_CPPFLAGS' (or '*_CPPFLAGS')
modules/Makefile.am:3: warning: 'INCLUDES' is the old name for 'AM_CPPFLAGS' (or '*_CPPFLAGS')
programs/Makefile.am:3: warning: 'INCLUDES' is the old name for 'AM_CPPFLAGS' (or '*_CPPFLAGS')
test/Makefile.am:3: warning: 'INCLUDES' is the old name for 'AM_CPPFLAGS' (or '*_CPPFLAGS')
parallel-tests: installing './test-driver'
automake-1.13: error: using '$(srcdir)' in TESTS is currently broken: '$(srcdir)/auto-test'



Portage 2.2.0_alpha173 (hardened/linux/amd64/selinux, gcc-4.8.0, glibc-2.17, 3.8.8-pax.x86_64 x86_64)
=================================================================
                         System Settings
=================================================================
System uname: Linux-3.8.8-pax.x86_64-x86_64-Intel-R-_Core-TM-2_Quad_CPU_Q9300_@_2.50GHz-with-gentoo-2.2
KiB Mem:     6114284 total,    452036 free
KiB Swap:   10484724 total,  10292164 free
Timestamp of tree: Tue, 23 Apr 2013 23:15:01 +0000
ld GNU gold (GNU Binutils 2.23.2) 1.11
ccache version 3.1.9 [disabled]
app-shells/bash:          4.2_p45
dev-java/java-config:     2.2.0
dev-lang/python:          2.5.4-r5, 2.6.8-r1, 2.7.4, 3.1.5-r1, 3.2.3-r2, 3.3.0-r1
dev-util/ccache:          3.1.9
dev-util/cmake:           2.8.10.2-r2
dev-util/pkgconfig:       0.28
sys-apps/baselayout:      2.2
sys-apps/openrc:          0.11.8
sys-apps/sandbox:         2.6-r1
sys-devel/autoconf:       2.13, 2.69
sys-devel/automake:       1.12.6, 1.13.1
sys-devel/binutils:       2.23.2
sys-devel/gcc:            4.6.4, 4.7.2-r1, 4.8.0
sys-devel/gcc-config:     1.8
sys-devel/libtool:        2.4.2
sys-devel/make:           3.82-r4
sys-kernel/linux-headers: 3.8 (virtual/os-headers)
sys-libs/glibc:           2.17
Repositories: gentoo systemd hardened-dev gnome custom
Installed sets: @local
ACCEPT_KEYWORDS="amd64 x86 ~amd64 ~x86"
ACCEPT_LICENSE="* -@EULA"
CBUILD="x86_64-pc-linux-gnu"
CFLAGS="-Wall -Wextra -ggdb -march=native -pipe -O3 -fno-tree-vectorize -frecord-gcc-switches"
CHOST="x86_64-pc-linux-gnu"
CONFIG_PROTECT="/etc /usr/share/config /usr/share/gnupg/qualified.txt /usr/share/polkit-1/actions /var/bind"
CONFIG_PROTECT_MASK="/etc/ca-certificates.conf /etc/dconf /etc/env.d /etc/fonts/fonts.conf /etc/gconf /etc/gentoo-release /etc/revdep-rebuild /etc/sandbox.d /etc/splash /etc/terminfo"
CXXFLAGS="-Wall -Wextra -ggdb -march=native -pipe -O3 -fno-tree-vectorize -frecord-gcc-switches"
DISTDIR="/var/portage/distfiles"
EMERGE_DEFAULT_OPTS="--keep-going"
FCFLAGS="-Wall -Wextra -ggdb -march=native -pipe -O3 -fno-tree-vectorize -frecord-gcc-switches"
FEATURES="assume-digests binpkg-logs buildpkg collision-protect config-protect-if-modified distlocks ebuild-locks fixlafiles merge-sync multilib-strict news parallel-fetch preserve-libs protect-owned sandbox selinux sesandbox sfperms split-elog split-log splitdebug strict test test-fail-continue unknown-features-warn unmerge-logs unmerge-orphans userfetch userpriv usersandbox usersync webrsync-gpg xattr"
FFLAGS="-Wall -Wextra -ggdb -march=native -pipe -O3 -fno-tree-vectorize -frecord-gcc-switches"
GENTOO_MIRRORS="http://mirrors.163.com/gentoo http://distfiles.gentoo.org"
LANG="en_US.UTF-8"
LDFLAGS="-Wl,-O1 -Wl,--as-needed -Wl,--hash-style=gnu -Wl,--icf=safe"
MAKEOPTS="V=1 -j10"
PKGDIR="/var/portage/packages-amd64"
PORTAGE_BZIP2_COMMAND="lbzip2"
PORTAGE_COMPRESS="xz"
PORTAGE_COMPRESS_FLAGS="-9ef"
PORTAGE_CONFIGROOT="/"
PORTAGE_RSYNC_EXTRA_OPTS="--ipv4"
PORTAGE_RSYNC_OPTS="--recursive --links --safe-links --perms --times --compress --force --whole-file --delete --stats --human-readable --timeout=180 --exclude=/distfiles --exclude=/local --exclude=/packages"
PORTAGE_TMPDIR="/var/tmp"
PORTDIR="/usr/portage"
PORTDIR_OVERLAY="/var/lib/layman/systemd /var/lib/layman/hardened-development /var/lib/layman/gnome /usr/local/portage"
SYNC="rsync://mirrors.ustc.edu.cn/gentoo-portage"
USE="X acl alsa amd64 audit bash-completion berkdb bzip2 c++0x cairo caps cli cracklib crypt custom-cflags cxx dbus dri ffmpeg gdbm gmp gnome gpm gtk gtk3 hardened iconv icu ipv6 jit jpeg jpeg2k justify lzma mmx modules mudflap multilib ncurses nls nptl open_perms opengl openmp orc pam pax_kernel pcre png pulseaudio qt4 readline selinux session sse sse2 ssl svg systemd tcpd threads tiff udev unicode urandom vim-syntax xattr xinetd zlib" ABI_X86="x32 32 64" ALSA_CARDS="hda-intel" ALSA_PCM_PLUGINS="adpcm alaw asym copy dmix dshare dsnoop empty extplug file hooks iec958 ioplug ladspa lfloat linear meter mmap_emul mulaw multi null plug rate route share shm softvol" APACHE2_MODULES="authn_core authz_core socache_shmcb unixd actions alias auth_basic authn_alias authn_anon authn_dbm authn_default authn_file authz_dbm authz_default authz_groupfile authz_host authz_owner authz_user autoindex cache cgi cgid dav dav_fs dav_lock deflate dir disk_cache env expires ext_filter file_cache filter headers include info log_config logio mem_cache mime mime_magic negotiation rewrite setenvif speling status unique_id userdir usertrack vhost_alias" CALLIGRA_FEATURES="kexi words flow plan sheets stage tables krita karbon braindump" CAMERAS="ptp2" COLLECTD_PLUGINS="df interface irq load memory rrdtool swap syslog" DRACUT_MODULES="btrfs caps dmsquash-live gensplash livenet lvm nfs ssh-client syslog systemd" ELIBC="glibc" GPSD_PROTOCOLS="ashtech aivdm earthmate evermore fv18 garmin garmintxt gpsclock itrax mtk3301 nmea ntrip navcom oceanserver oldstyle oncore rtcm104v2 rtcm104v3 sirf superstar2 timing tsip tripmate tnt ubx" INPUT_DEVICES="evdev" KERNEL="linux" LCD_DEVICES="bayrad cfontz cfontz633 glk hd44780 lb216 lcdm001 mtxorb ncurses text" LIBREOFFICE_EXTENSIONS="presenter-console presenter-minimizer" LINGUAS="en en_US zh zh_CN" OFFICE_IMPLEMENTATION="libreoffice" PHP_TARGETS="php5-3" PYTHON_SINGLE_TARGET="python2_7" PYTHON_TARGETS="pypy1_9 pypy2_0 python3_1 python3_2 python3_3 python2_5 python2_6 python2_7" QEMU_SOFTMMU_TARGETS="x86_64 arm mips64el ppc64" RUBY_TARGETS="ruby18 ruby19" USERLAND="GNU" VIDEO_CARDS="nouveau nvidia" XTABLES_ADDONS="quota2 psd pknock lscan length2 ipv4options ipset ipp2p iface geoip fuzzy condition tee tarpit sysrq steal rawnat logmark ipmark dhcpmac delude chaos account"
USE_PYTHON="2.7-pypy-1.9 2.7-pypy-2.0 3.1 3.2 3.3 2.5 2.6 2.7"
Unset:  CPPFLAGS, CTARGET, INSTALL_MASK, LC_ALL, PORTAGE_BUNZIP2_COMMAND

=================================================================
                        Package Settings
=================================================================

gnome-base/gnome-vfs-2.24.4-r1 was built with the following:
USE="acl fam ipv6 (multilib) samba (selinux) ssl test -avahi -doc -gnutls -kerberos"
Comment 1 beizhuchun 2013-04-27 11:13:01 UTC
Portage 2.1.11.62 (default/linux/amd64/13.0/desktop/gnome, gcc-4.7.2, glibc-2.17, 3.8.10-gentoo x86_64)
=================================================================
                         System Settings
=================================================================
System uname: Linux-3.8.10-gentoo-x86_64-Intel-R-_Core-TM-_i7-3610QM_CPU_@_2.30GHz-with-gentoo-2.2
KiB Mem:     8075652 total,   5945240 free
KiB Swap:    2097148 total,   2097148 free
Timestamp of tree: Sat, 27 Apr 2013 10:45:01 +0000
ld GNU ld (GNU Binutils) 2.23.1
ccache version 3.1.9 [enabled]
app-shells/bash:          4.2_p45
dev-java/java-config:     2.2.0
dev-lang/python:          2.7.3-r3, 3.2.3-r2
dev-util/ccache:          3.1.9-r1::science
dev-util/cmake:           2.8.10.2-r2
dev-util/pkgconfig:       0.28
sys-apps/baselayout:      2.2
sys-apps/openrc:          0.11.8
sys-apps/sandbox:         2.6-r1
sys-devel/autoconf:       2.13, 2.69
sys-devel/automake:       1.10.3, 1.11.6, 1.12.6, 1.13.1
sys-devel/binutils:       2.23.1
sys-devel/gcc:            4.7.2-r1
sys-devel/gcc-config:     1.8
sys-devel/libtool:        2.4.2
sys-devel/make:           3.82-r4
sys-kernel/linux-headers: 3.8 (virtual/os-headers)
sys-libs/glibc:           2.17
Repositories: gentoo bumblebee gentoo-zh mva science sunrise local
ACCEPT_KEYWORDS="amd64 ~amd64"
ACCEPT_LICENSE="* -@EULA"
CBUILD="x86_64-pc-linux-gnu"
CFLAGS="-march=native -O2 -pipe"
CHOST="x86_64-pc-linux-gnu"
CONFIG_PROTECT="/etc /usr/share/gnupg/qualified.txt"
CONFIG_PROTECT_MASK="/etc/ca-certificates.conf /etc/dconf /etc/env.d /etc/fonts/fonts.conf /etc/gconf /etc/gentoo-release /etc/revdep-rebuild /etc/sandbox.d /etc/terminfo"
CXXFLAGS="-march=native -O2 -pipe"
DISTDIR="/var/portage/distfiles"
FCFLAGS="-march=native -O2 -pipe"
FEATURES="assume-digests binpkg-logs ccache config-protect-if-modified distlocks ebuild-locks fixlafiles merge-sync news parallel-fetch protect-owned sandbox sfperms strict unknown-features-warn unmerge-logs unmerge-orphans userfetch"
FFLAGS="-march=native -O2 -pipe"
GENTOO_MIRRORS="http://mirrors.163.com/gentoo/ http://mirrors.sohu.com/gentoo/ http://mirrors.stuhome.net/gentoo/ http://mirrors.xmu.edu.cn/gentoo"
LANG="zh_CN.UTF-8"
LDFLAGS="-Wl,-O1 -Wl,--as-needed"
MAKEOPTS="-j9"
PKGDIR="/var/portage/packages"
PORTAGE_CONFIGROOT="/"
PORTAGE_RSYNC_OPTS="--recursive --links --safe-links --perms --times --compress --force --whole-file --delete --stats --human-readable --timeout=180 --exclude=/distfiles --exclude=/local --exclude=/packages"
PORTAGE_TMPDIR="/var/tmp"
PORTDIR="/var/portage"
PORTDIR_OVERLAY="/var/lib/layman/bumblebee /var/lib/layman/gentoo-zh /var/lib/layman/mva /var/lib/layman/science /var/lib/layman/sunrise /var/local"
SYNC="rsync://rsync.asia.gentoo.org/gentoo-portage"
USE="X a52 aac acl acpi alsa amd64 berkdb bindist bluetooth branding bzip2 cairo cdda cdr cjk cli colord consolekit cracklib crypt cups cxx dbus dri dts dvd dvdr eds emboss encode evo exif fam firefox flac fortran gdbm gif gnome gnome-keyring gnome-online-accounts gpm gstreamer gtk i18n iconv ipv6 jpeg lcms ldap libnotify libsecret mad mmx mng modules mp3 mp4 mpeg mudflap multilib nautilus ncurses nls nptl ogg opengl openmp pam pango pcre pdf png policykit ppds pulseaudio qt3support readline sdl session socialweb spell sse sse2 ssl startup-notification svg symlink tcpd tiff truetype udev udisks unicode upower usb vorbis wxwidgets x264 xcb xml xv xvid zlib" ABI_X86="64" ALSA_CARDS="ali5451 als4000 atiixp atiixp-modem bt87x ca0106 cmipci emu10k1x ens1370 ens1371 es1938 es1968 fm801 hda-intel intel8x0 intel8x0m maestro3 trident usb-audio via82xx via82xx-modem ymfpci" ALSA_PCM_PLUGINS="adpcm alaw asym copy dmix dshare dsnoop empty extplug file hooks iec958 ioplug ladspa lfloat linear meter mmap_emul mulaw multi null plug rate route share shm softvol" APACHE2_MODULES="authn_core authz_core socache_shmcb unixd actions alias auth_basic authn_alias authn_anon authn_dbm authn_default authn_file authz_dbm authz_default authz_groupfile authz_host authz_owner authz_user autoindex cache cgi cgid dav dav_fs dav_lock deflate dir disk_cache env expires ext_filter file_cache filter headers include info log_config logio mem_cache mime mime_magic negotiation rewrite setenvif speling status unique_id userdir usertrack vhost_alias" CALLIGRA_FEATURES="kexi words flow plan sheets stage tables krita karbon braindump" CAMERAS="ptp2" COLLECTD_PLUGINS="df interface irq load memory rrdtool swap syslog" ELIBC="glibc" GPSD_PROTOCOLS="ashtech aivdm earthmate evermore fv18 garmin garmintxt gpsclock itrax mtk3301 nmea ntrip navcom oceanserver oldstyle oncore rtcm104v2 rtcm104v3 sirf superstar2 timing tsip tripmate tnt ubx" INPUT_DEVICES="evdev synaptics" KERNEL="linux" LCD_DEVICES="bayrad cfontz cfontz633 glk hd44780 lb216 lcdm001 mtxorb ncurses text" LIBREOFFICE_EXTENSIONS="presenter-console presenter-minimizer" LINGUAS="zh_CN zh en" OFFICE_IMPLEMENTATION="libreoffice" PHP_TARGETS="php5-3" PYTHON_SINGLE_TARGET="python2_7" PYTHON_TARGETS="python2_7 python3_2" RUBY_TARGETS="ruby18 ruby19" USERLAND="GNU" VIDEO_CARDS="intel nvidia" XTABLES_ADDONS="quota2 psd pknock lscan length2 ipv4options ipset ipp2p iface geoip fuzzy condition tee tarpit sysrq steal rawnat logmark ipmark dhcpmac delude chaos account"
Unset:  CPPFLAGS, CTARGET, EMERGE_DEFAULT_OPTS, INSTALL_MASK, LC_ALL, PORTAGE_BUNZIP2_COMMAND, PORTAGE_COMPRESS, PORTAGE_COMPRESS_FLAGS, PORTAGE_RSYNC_EXTRA_OPTS, USE_PYTHON

=================================================================
                        Package Settings
=================================================================

gnome-base/gnome-vfs-2.24.4-r1 was built with the following:
USE="acl fam ipv6 (multilib) ssl -avahi -doc -gnutls -kerberos -samba -test" ABI_X86="64"

***** aclocal *****
***** PWD: /var/tmp/portage/gnome-base/gnome-vfs-2.24.4-r1/work/gnome-vfs-2.24.4
***** aclocal

aclocal-1.13: warning: autoconf input should be named 'configure.ac', not 'configure.in'
configure.in:36: error: 'AM_CONFIG_HEADER': this macro is obsolete.
    You should use the 'AC_CONFIG_HEADERS' macro instead.
/usr/share/aclocal-1.13/obsolete-err.m4:12: AM_CONFIG_HEADER is expanded from...
configure.in:36: the top level
autom4te-2.69: /usr/bin/m4 failed with exit status: 1
aclocal-1.13: error: echo failed with exit status: 1
Comment 2 Justin Lecher gentoo-dev 2013-05-05 12:00:44 UTC
+  05 May 2013; Justin Lecher <jlec@gentoo.org> gnome-vfs-2.24.4-r1.ebuild,
+  +files/gnome-vfs-2.24.4-automake-1.13.patch:
+  Fix obsolete macros to work with automake-1.13, #466944
+