Gentoo Websites Logo
Go to: Gentoo Home Documentation Forums Lists Bugs Planet Store Wiki Get Gentoo!
Bug 456904 - [mozilla overlay] dev-lang/spidermonkey-1.8.8 - ./dist/include/js/HashTable.h:898:9: error: size of array 'moz_static_assert19' is negative
Summary: [mozilla overlay] dev-lang/spidermonkey-1.8.8 - ./dist/include/js/HashTable.h...
Status: RESOLVED WONTFIX
Alias: None
Product: Gentoo Linux
Classification: Unclassified
Component: Current packages (show other bugs)
Hardware: x86 Linux
: Normal normal (vote)
Assignee: Mozilla Gentoo Team
URL:
Whiteboard:
Keywords:
Depends on:
Blocks:
 
Reported: 2013-02-12 10:00 UTC by Stoian Ivanov
Modified: 2013-08-26 15:01 UTC (History)
1 user (show)

See Also:
Package list:
Runtime testing required: ---


Attachments

Note You need to log in before you can comment on or make changes to this bug.
Description Stoian Ivanov 2013-02-12 10:00:24 UTC
JIT=1   -DMOZILLA_CLIENT -include ./js-confdefs.h -MD -MF .deps/jsanalyze.o.pp /var/tmp/portage/dev-lang/spidermonkey-1.8.8/work/js-1.8.8/js/src/jsanalyze.cpp
jsapi.cpp
In file included from /var/tmp/portage/dev-lang/spidermonkey-1.8.8/work/js-1.8.8/js/src/jsapi.h:26:0,
                 from /var/tmp/portage/dev-lang/spidermonkey-1.8.8/work/js-1.8.8/js/src/jscntxt.h:17,
                 from /var/tmp/portage/dev-lang/spidermonkey-1.8.8/work/js-1.8.8/js/src/jsalloc.cpp:9:
/var/tmp/portage/dev-lang/spidermonkey-1.8.8/work/js-1.8.8/js/src/gc/Root.h: In static member function 'static void JS::RootSink<JSStableString*>::dispose(JSStableString*)':
/var/tmp/portage/dev-lang/spidermonkey-1.8.8/work/js-1.8.8/js/src/gc/Root.h:279:35: warning: variable 'sink' set but not used [-Wunused-but-set-variable]
In file included from /var/tmp/portage/dev-lang/spidermonkey-1.8.8/work/js-1.8.8/js/src/jsapi.h:26:0,
                 from /var/tmp/portage/dev-lang/spidermonkey-1.8.8/work/js-1.8.8/js/src/jscntxt.h:17,
                 from /var/tmp/portage/dev-lang/spidermonkey-1.8.8/work/js-1.8.8/js/src/jscompartment.h:11,
                 from /var/tmp/portage/dev-lang/spidermonkey-1.8.8/work/js-1.8.8/js/src/jsanalyze.h:13,
                 from /var/tmp/portage/dev-lang/spidermonkey-1.8.8/work/js-1.8.8/js/src/jsanalyze.cpp:7:
/var/tmp/portage/dev-lang/spidermonkey-1.8.8/work/js-1.8.8/js/src/gc/Root.h: In static member function 'static void JS::RootSink<JSStableString*>::dispose(JSStableString*)':
/var/tmp/portage/dev-lang/spidermonkey-1.8.8/work/js-1.8.8/js/src/gc/Root.h:279:35: warning: variable 'sink' set but not used [-Wunused-but-set-variable]
In file included from /var/tmp/portage/dev-lang/spidermonkey-1.8.8/work/js-1.8.8/js/src/jsprvtd.h:28:0,
                 from /var/tmp/portage/dev-lang/spidermonkey-1.8.8/work/js-1.8.8/js/src/jsclass.h:17,
                 from /var/tmp/portage/dev-lang/spidermonkey-1.8.8/work/js-1.8.8/js/src/jsfriendapi.h:10,
                 from /var/tmp/portage/dev-lang/spidermonkey-1.8.8/work/js-1.8.8/js/src/jscntxt.h:18,
                 from /var/tmp/portage/dev-lang/spidermonkey-1.8.8/work/js-1.8.8/js/src/jsalloc.cpp:9:
./dist/include/js/HashTable.h: In static member function 'static js::HashNumber js::PointerHasher<Key, zeroBits>::hash(const Lookup&)':
./dist/include/js/HashTable.h:898:9: error: size of array 'moz_static_assert19' is negative
./dist/include/js/HashTable.h:899:36: warning: right shift count >= width of type [enabled by default]
In file included from /var/tmp/portage/dev-lang/spidermonkey-1.8.8/work/js-1.8.8/js/src/gc/Barrier.h:13:0,
                 from /var/tmp/portage/dev-lang/spidermonkey-1.8.8/work/js-1.8.8/js/src/jsatom.h:18,
                 from /var/tmp/portage/dev-lang/spidermonkey-1.8.8/work/js-1.8.8/js/src/jscntxt.h:20,
                 from /var/tmp/portage/dev-lang/spidermonkey-1.8.8/work/js-1.8.8/js/src/jsalloc.cpp:9:
./gc/Heap.h: At global scope:
./gc/Heap.h:459:63: warning: width of 'js::gc::ArenaHeader::auxNextLink' exceeds its type [enabled by default]
./gc/Heap.h:731:1: error: size of array 'moz_static_assert41' is negative
./gc/Heap.h:740:1: error: size of array 'moz_static_assert42' is negative
In file included from /var/tmp/portage/dev-lang/spidermonkey-1.8.8/work/js-1.8.8/js/src/jscntxt.h:20:0,
                 from /var/tmp/portage/dev-lang/spidermonkey-1.8.8/work/js-1.8.8/js/src/jsalloc.cpp:9:
/var/tmp/portage/dev-lang/spidermonkey-1.8.8/work/js-1.8.8/js/src/jsatom.h:87:1: error: size of array 'moz_static_assert50' is negative
In file included from /var/tmp/portage/dev-lang/spidermonkey-1.8.8/work/js-1.8.8/js/src/jsprvtd.h:28:0,
                 from /var/tmp/portage/dev-lang/spidermonkey-1.8.8/work/js-1.8.8/js/src/jsclass.h:17,
                 from /var/tmp/portage/dev-lang/spidermonkey-1.8.8/work/js-1.8.8/js/src/jsfriendapi.h:10,
                 from /var/tmp/portage/dev-lang/spidermonkey-1.8.8/work/js-1.8.8/js/src/jscntxt.h:18,
                 from /var/tmp/portage/dev-lang/spidermonkey-1.8.8/work/js-1.8.8/js/src/jscompartment.h:11,
                 from /var/tmp/portage/dev-lang/spidermonkey-1.8.8/work/js-1.8.8/js/src/jsanalyze.h:13,
                 from /var/tmp/portage/dev-lang/spidermonkey-1.8.8/work/js-1.8.8/js/src/jsanalyze.cpp:7:
./dist/include/js/HashTable.h: In static member function 'static js::HashNumber js::PointerHasher<Key, zeroBits>::hash(const Lookup&)':
./dist/include/js/HashTable.h:898:9: error: size of array 'moz_static_assert19' is negative
./dist/include/js/HashTable.h:899:36: warning: right shift count >= width of type [enabled by default]
In file included from /var/tmp/portage/dev-lang/spidermonkey-1.8.8/work/js-1.8.8/js/src/gc/Barrier.h:13:0,
                 from /var/tmp/portage/dev-lang/spidermonkey-1.8.8/work/js-1.8.8/js/src/jsatom.h:18,
                 from /var/tmp/portage/dev-lang/spidermonkey-1.8.8/work/js-1.8.8/js/src/jscntxt.h:20,
                 from /var/tmp/portage/dev-lang/spidermonkey-1.8.8/work/js-1.8.8/js/src/jscompartment.h:11,
                 from /var/tmp/portage/dev-lang/spidermonkey-1.8.8/work/js-1.8.8/js/src/jsanalyze.h:13,
                 from /var/tmp/portage/dev-lang/spidermonkey-1.8.8/work/js-1.8.8/js/src/jsanalyze.cpp:7:
./gc/Heap.h: At global scope:
./gc/Heap.h:459:63: warning: width of 'js::gc::ArenaHeader::auxNextLink' exceeds its type [enabled by default]
./gc/Heap.h:731:1: error: size of array 'moz_static_assert41' is negative
./gc/Heap.h:740:1: error: size of array 'moz_static_assert42' is negative
In file included from /var/tmp/portage/dev-lang/spidermonkey-1.8.8/work/js-1.8.8/js/src/jscntxt.h:20:0,
                 from /var/tmp/portage/dev-lang/spidermonkey-1.8.8/work/js-1.8.8/js/src/jscompartment.h:11,
                 from /var/tmp/portage/dev-lang/spidermonkey-1.8.8/work/js-1.8.8/js/src/jsanalyze.h:13,
                 from /var/tmp/portage/dev-lang/spidermonkey-1.8.8/work/js-1.8.8/js/src/jsanalyze.cpp:7:
/var/tmp/portage/dev-lang/spidermonkey-1.8.8/work/js-1.8.8/js/src/jsatom.h:87:1: error: size of array 'moz_static_assert50' is negative
In file included from ./jsscript.h:17:0,
                 from ./jsfun.h:16,
                 from /var/tmp/portage/dev-lang/spidermonkey-1.8.8/work/js-1.8.8/js/src/vm/Stack.h:12,
                 from /var/tmp/portage/dev-lang/spidermonkey-1.8.8/work/js-1.8.8/js/src/jscntxt.h:32,
                 from /var/tmp/portage/dev-lang/spidermonkey-1.8.8/work/js-1.8.8/js/src/jsalloc.cpp:9:
./jsopcode.h:637:1: error: size of array 'moz_static_assert89' is negative
In file included from ./jsfun.h:16:0,
                 from /var/tmp/portage/dev-lang/spidermonkey-1.8.8/work/js-1.8.8/js/src/vm/Stack.h:12,
                 from /var/tmp/portage/dev-lang/spidermonkey-1.8.8/work/js-1.8.8/js/src/jscntxt.h:32,
                 from /var/tmp/portage/dev-lang/spidermonkey-1.8.8/work/js-1.8.8/js/src/jsalloc.cpp:9:
./jsscript.h:853:1: error: size of array 'moz_static_assert97' is negative
In file included from ./jsscript.h:17:0,
                 from ./jsfun.h:16,
                 from /var/tmp/portage/dev-lang/spidermonkey-1.8.8/work/js-1.8.8/js/src/vm/Stack.h:12,
                 from /var/tmp/portage/dev-lang/spidermonkey-1.8.8/work/js-1.8.8/js/src/jscntxt.h:32,
                 from /var/tmp/portage/dev-lang/spidermonkey-1.8.8/work/js-1.8.8/js/src/jscompartment.h:11,
                 from /var/tmp/portage/dev-lang/spidermonkey-1.8.8/work/js-1.8.8/js/src/jsanalyze.h:13,
                 from /var/tmp/portage/dev-lang/spidermonkey-1.8.8/work/js-1.8.8/js/src/jsanalyze.cpp:7:
./jsopcode.h:637:1: error: size of array 'moz_static_assert89' is negative
/var/tmp/portage/dev-lang/spidermonkey-1.8.8/work/js-1.8.8/js/src/vm/String.h:398:24: warning: inline function 'static void JSString::writeBarrierPost(JSString*, void*)' used but never defined [enabled by default]
/var/tmp/portage/dev-lang/spidermonkey-1.8.8/work/js-1.8.8/js/src/vm/String.h:397:24: warning: inline function 'static void JSString::writeBarrierPre(JSString*)' used but never defined [enabled by default]
make[1]: *** [jsalloc.o] Error 1
make[1]: *** Waiting for unfinished jobs....
In file included from ./jsfun.h:16:0,
                 from /var/tmp/portage/dev-lang/spidermonkey-1.8.8/work/js-1.8.8/js/src/vm/Stack.h:12,
                 from /var/tmp/portage/dev-lang/spidermonkey-1.8.8/work/js-1.8.8/js/src/jscntxt.h:32,
                 from /var/tmp/portage/dev-lang/spidermonkey-1.8.8/work/js-1.8.8/js/src/jscompartment.h:11,
                 from /var/tmp/portage/dev-lang/spidermonkey-1.8.8/work/js-1.8.8/js/src/jsanalyze.h:13,
                 from /var/tmp/portage/dev-lang/spidermonkey-1.8.8/work/js-1.8.8/js/src/jsanalyze.cpp:7:
./jsscript.h:853:1: error: size of array 'moz_static_assert97' is negative
In file included from /var/tmp/portage/dev-lang/spidermonkey-1.8.8/work/js-1.8.8/js/src/jsprvtd.h:28:0,
                 from /var/tmp/portage/dev-lang/spidermonkey-1.8.8/work/js-1.8.8/js/src/jsclass.h:17,
                 from /var/tmp/portage/dev-lang/spidermonkey-1.8.8/work/js-1.8.8/js/src/jsfriendapi.h:10,
                 from /var/tmp/portage/dev-lang/spidermonkey-1.8.8/work/js-1.8.8/js/src/jscntxt.h:18,
                 from /var/tmp/portage/dev-lang/spidermonkey-1.8.8/work/js-1.8.8/js/src/jscompartment.h:11,
                 from /var/tmp/portage/dev-lang/spidermonkey-1.8.8/work/js-1.8.8/js/src/jsanalyze.h:13,
                 from /var/tmp/portage/dev-lang/spidermonkey-1.8.8/work/js-1.8.8/js/src/jsanalyze.cpp:7:
./dist/include/js/HashTable.h: In static member function 'static js::HashNumber js::PointerHasher<Key, zeroBits>::hash(const Lookup&) [with Key = JSAtom*, unsigned int zeroBits = 2u, js::HashNumber = unsigned int, js::PointerHasher<Key, zeroBits>::Lookup = JSAtom*]':
/var/tmp/portage/dev-lang/spidermonkey-1.8.8/work/js-1.8.8/js/src/vm/RegExpObject.h:249:45:   instantiated from here
./dist/include/js/HashTable.h:899:46: warning: right shift count >= width of type [enabled by default]
./dist/include/js/HashTable.h: In static member function 'static js::HashNumber js::PointerHasher<Key, zeroBits>::hash(const Lookup&) [with Key = JSC::ExecutablePool*, unsigned int zeroBits = 2u, js::HashNumber = unsigned int, js::PointerHasher<Key, zeroBits>::Lookup = JSC::ExecutablePool*]':
./dist/include/js/HashTable.h:304:66:   instantiated from 'static js::HashNumber js::detail::HashTable<T, HashPolicy, AllocPolicy>::prepareHash(const Lookup&) [with T = JSC::ExecutablePool* const, HashPolicy = js::HashSet<JSC::ExecutablePool*, js::DefaultHasher<JSC::ExecutablePool*>, js::SystemAllocPolicy>::SetOps, AllocPolicy = js::SystemAllocPolicy, js::HashNumber = unsigned int, js::detail::HashTable<T, HashPolicy, AllocPolicy>::Lookup = JSC::ExecutablePool*]'
./dist/include/js/HashTable.h:723:43:   instantiated from 'js::detail::HashTable<T, HashPolicy, AllocPolicy>::Ptr js::detail::HashTable<T, HashPolicy, AllocPolicy>::lookup(const Lookup&) const [with T = JSC::ExecutablePool* const, HashPolicy = js::HashSet<JSC::ExecutablePool*, js::DefaultHasher<JSC::ExecutablePool*>, js::SystemAllocPolicy>::SetOps, AllocPolicy = js::SystemAllocPolicy, js::detail::HashTable<T, HashPolicy, AllocPolicy>::Lookup = JSC::ExecutablePool*]'
./dist/include/js/HashTable.h:1283:77:   instantiated from 'js::HashSet<T, HashPolicy, AllocPolicy>::Ptr js::HashSet<T, HashPolicy, AllocPolicy>::lookup(const Lookup&) const [with T = JSC::ExecutablePool*, HashPolicy = js::DefaultHasher<JSC::ExecutablePool*>, AllocPolicy = js::SystemAllocPolicy, js::HashSet<T, HashPolicy, AllocPolicy>::Ptr = js::detail::HashTable<JSC::ExecutablePool* const, js::HashSet<JSC::ExecutablePool*, js::DefaultHasher<JSC::ExecutablePool*>, js::SystemAllocPolicy>::SetOps, js::SystemAllocPolicy>::Ptr, js::HashSet<T, HashPolicy, AllocPolicy>::Lookup = JSC::ExecutablePool*]'
./assembler/jit/ExecutableAllocator.h:245:43:   instantiated from here
./dist/include/js/HashTable.h:899:46: warning: right shift count >= width of type [enabled by default]
./vm/ObjectImpl-inl.h: At global scope:
./vm/ObjectImpl-inl.h:214:1: warning: 'bool IsValueInCompartment(JS::Value, JSCompartment*)' defined but not used [-Wunused-function]
make[1]: *** [jsanalyze.o] Error 1
make[1]: Leaving directory `/var/tmp/portage/dev-lang/spidermonkey-1.8.8/work/js-1.8.8/js/src'
make: *** [default] Error 2
 * ERROR: dev-lang/spidermonkey-1.8.8 failed (compile phase):
 *   emake failed
 * 
 * If you need support, post the output of `emerge --info '=dev-lang/spidermonkey-1.8.8'`,
 * the complete build log and the output of `emerge -pqv '=dev-lang/spidermonkey-1.8.8'`.
 * This ebuild is from an overlay named 'mozilla': '/var/lib/layman/mozilla/'
 * The complete build log is located at '/var/tmp/portage/dev-lang/spidermonkey-1.8.8/temp/build.log'.
 * The ebuild environment file is located at '/var/tmp/portage/dev-lang/spidermonkey-1.8.8/temp/environment'.
 * Working directory: '/var/tmp/portage/dev-lang/spidermonkey-1.8.8/work/js-1.8.8/js/src'
 * S: '/var/tmp/portage/dev-lang/spidermonkey-1.8.8/work/js-1.8.8'

>>> Failed to emerge dev-lang/spidermonkey-1.8.8, Log file:

>>>  '/var/tmp/portage/dev-lang/spidermonkey-1.8.8/temp/build.log'

 * Messages for package dev-lang/spidermonkey-1.8.8:

 * ERROR: dev-lang/spidermonkey-1.8.8 failed (compile phase):
 *   emake failed
 * 
 * If you need support, post the output of `emerge --info '=dev-lang/spidermonkey-1.8.8'`,
 * the complete build log and the output of `emerge -pqv '=dev-lang/spidermonkey-1.8.8'`.
 * This ebuild is from an overlay named 'mozilla': '/var/lib/layman/mozilla/'
 * The complete build log is located at '/var/tmp/portage/dev-lang/spidermonkey-1.8.8/temp/build.log'.
 * The ebuild environment file is located at '/var/tmp/portage/dev-lang/spidermonkey-1.8.8/temp/environment'.
 * Working directory: '/var/tmp/portage/dev-lang/spidermonkey-1.8.8/work/js-1.8.8/js/src'
 * S: '/var/tmp/portage/dev-lang/spidermonkey-1.8.8/work/js-1.8.8'
Scanning Configuration files...
Exiting: Nothing left to do; exiting. :)


Reproducible: Always
Comment 1 Stoian Ivanov 2013-02-12 10:00:58 UTC
emerge --info
Portage 2.1.11.51 (default/linux/x86/13.0/desktop/kde, gcc-4.6.3, glibc-2.16.0, 3.7.4-gentoo i686)
=================================================================
System uname: Linux-3.7.4-gentoo-i686-Pentium-R-_Dual-Core_CPU_E5300_@_2.60GHz-with-gentoo-2.2
KiB Mem:     2065068 total,     63044 free
KiB Swap:    2996020 total,   2904012 free
Timestamp of tree: Tue, 12 Feb 2013 08:30:01 +0000
ld GNU ld (GNU Binutils) 2.23.1
app-shells/bash:          4.2_p42
dev-java/java-config:     2.1.12-r1
dev-lang/python:          2.6.8-r1, 2.7.3-r3, 3.2.3-r2
dev-util/cmake:           2.8.10.2-r1
dev-util/pkgconfig:       0.28
sys-apps/baselayout:      2.2
sys-apps/openrc:          0.11.8
sys-apps/sandbox:         2.6
sys-devel/autoconf:       2.13, 2.69
sys-devel/automake:       1.9.6-r3, 1.11.6, 1.12.6, 1.13.1
sys-devel/binutils:       2.23.1
sys-devel/gcc:            4.6.3
sys-devel/gcc-config:     1.8
sys-devel/libtool:        2.4.2
sys-devel/make:           3.82-r4
sys-kernel/linux-headers: 3.7 (virtual/os-headers)
sys-libs/glibc:           2.16.0
Repositories: gentoo mozilla my_local_overlay
ACCEPT_KEYWORDS="x86 ~x86"
ACCEPT_LICENSE="* -@EULA"
CBUILD="i686-pc-linux-gnu"
CFLAGS="-march=i686 -O2 -pipe"
CHOST="i686-pc-linux-gnu"
CONFIG_PROTECT="/etc /usr/share/config /usr/share/gnupg/qualified.txt /usr/share/polkit-1/actions /usr/share/themes/oxygen-gtk/gtk-2.0 /var/lib/hsqldb"
CONFIG_PROTECT_MASK="/etc/ca-certificates.conf /etc/env.d /etc/fonts/fonts.conf /etc/gconf /etc/gentoo-release /etc/php/apache2-php5.4/ext-active/ /etc/php/cgi-php5.4/ext-active/ /etc/php/cli-php5.4/ext-active/ /etc/revdep-rebuild /etc/sandbox.d /etc/splash /etc/terminfo"
CXXFLAGS="-march=i686 -O2 -pipe"
DISTDIR="/usr/portage/distfiles"
FCFLAGS="-O2 -march=i686 -pipe"
FEATURES="assume-digests binpkg-logs config-protect-if-modified distlocks ebuild-locks fixlafiles merge-sync news parallel-fetch protect-owned sandbox sfperms strict unknown-features-warn unmerge-logs unmerge-orphans userfetch"                                                                                                                                   
FFLAGS="-O2 -march=i686 -pipe"                                                                                                                                                     
GENTOO_MIRRORS="http://distfiles.gentoo.org"                                                                                                                                       
LDFLAGS="-Wl,-O1 -Wl,--as-needed"                                                                                                                                                  
MAKEOPTS="-j2"                                                                                                                                                                     
PKGDIR="/usr/portage/packages"                                                                                                                                                     
PORTAGE_CONFIGROOT="/"                                                                                                                                                             
PORTAGE_RSYNC_OPTS="--recursive --links --safe-links --perms --times --compress --force --whole-file --delete --stats --human-readable --timeout=180 --exclude=/distfiles --exclude=/local --exclude=/packages"                                                                                                                                                       
PORTAGE_TMPDIR="/var/tmp"                                                                                                                                                          
PORTDIR="/usr/portage"                                                                                                                                                             
PORTDIR_OVERLAY="/var/lib/layman/mozilla /usr/local/portage"                                                                                                                       
SYNC="rsync://rsync.gentoo.org/gentoo-portage"                                                                                                                                     
USE="X a52 aac acl acpi alsa apache2 berkdb bluetooth branding bzip2 cairo cdda cdr cli consolekit cracklib crypt cups cxx dbus declarative dri dts dvd dvdr emboss encode exif fam firefox flac gdbm gif gmp gpm iconv jpeg kde kipi lcms libnotify mad mmx mng modules mp3 mp4 mpeg mysql ncurses nls nptl nptlonly ogg opengl pam pango pcre pdf phonon plasma png policykit ppds qt qt3support qt4 readline sdl session slang spell sse sse2 ssl startup-notification svg tcpd tiff truetype udev udisks unicode upower usb vorbis wxwidgets x264 x86 xcb xcomposite xinerama xml xscreensaver xv xvid zlib" ALSA_CARDS="ali5451 als4000 atiixp atiixp-modem bt87x ca0106 cmipci emu10k1 emu10k1x ens1370 ens1371 es1938 es1968 fm801 hda-intel intel8x0 intel8x0m maestro3 trident usb-audio via82xx via82xx-modem ymfpci" ALSA_PCM_PLUGINS="adpcm alaw asym copy dmix dshare dsnoop empty extplug file hooks iec958 ioplug ladspa lfloat linear meter mmap_emul mulaw multi null plug rate route share shm softvol" APACHE2_MODULES="unixd authn_core authz_core socache_shmcb actions alias auth_basic auth_digest authn_anon authn_dbd authn_dbm authn_default authn_file authz_dbm authz_default authz_groupfile authz_host authz_owner authz_user autoindex cache dbd deflate dir disk_cache env expires ext_filter file_cache filter headers ident imagemap include info log_config logio mem_cache mime mime_magic negotiation rewrite setenvif so status unique_id userdir usertrack vhost_alias" CALLIGRA_FEATURES="kexi words flow plan sheets stage tables krita karbon braindump" CAMERAS="ptp2" COLLECTD_PLUGINS="df interface irq load memory rrdtool swap syslog" ELIBC="glibc" GPSD_PROTOCOLS="ashtech aivdm earthmate evermore fv18 garmin garmintxt gpsclock itrax mtk3301 nmea ntrip navcom oceanserver oldstyle oncore rtcm104v2 rtcm104v3 sirf superstar2 timing tsip tripmate tnt ubx" INPUT_DEVICES="keyboard mouse" KERNEL="linux" LCD_DEVICES="bayrad cfontz cfontz633 glk hd44780 lb216 lcdm001 mtxorb ncurses text" LIBREOFFICE_EXTENSIONS="presenter-console presenter-minimizer" LINGUAS="en en_GB bg" NETBEANS_MODULES="profiler enterprise apisupport harness ide java nb websvccommon ergonomics php" PHP_TARGETS="php5-3" PYTHON_SINGLE_TARGET="python2_7" PYTHON_TARGETS="python2_7 python3_2" QEMU_SOFTMMU_TARGETS="i386 x86_64" RUBY_TARGETS="ruby18 ruby19" USERLAND="GNU" VIDEO_CARDS="intel i965" XTABLES_ADDONS="quota2 psd pknock lscan length2 ipv4options ipset ipp2p iface geoip fuzzy condition tee tarpit sysrq steal rawnat logmark ipmark dhcpmac delude chaos account"
Unset:  CPPFLAGS, CTARGET, EMERGE_DEFAULT_OPTS, INSTALL_MASK, LANG, LC_ALL, PORTAGE_BUNZIP2_COMMAND, PORTAGE_COMPRESS, PORTAGE_COMPRESS_FLAGS, PORTAGE_RSYNC_EXTRA_OPTS, USE_PYTHON
Comment 2 Jeroen Roovers gentoo-dev 2013-02-12 16:50:39 UTC
Please attach the entire build log to this bug report.