Gentoo Websites Logo
Go to: Gentoo Home Documentation Forums Lists Bugs Planet Store Wiki Get Gentoo!
Bug 443274 - sys-devel/patch-2.7.1-r1 fails tests
Summary: sys-devel/patch-2.7.1-r1 fails tests
Status: RESOLVED DUPLICATE of bug 470210
Alias: None
Product: Gentoo Linux
Classification: Unclassified
Component: New packages (show other bugs)
Hardware: All Linux
: Normal normal (vote)
Assignee: Gentoo's Team for Core System packages
URL:
Whiteboard:
Keywords: TESTFAILURE
Depends on:
Blocks:
 
Reported: 2012-11-15 09:09 UTC by Patrick Lauer
Modified: 2013-05-21 21:20 UTC (History)
2 users (show)

See Also:
Package list:
Runtime testing required: ---


Attachments

Note You need to log in before you can comment on or make changes to this bug.
Description Patrick Lauer gentoo-dev 2012-11-15 09:09:35 UTC
make[4]: Entering directory `/var/tmp/portage/sys-devel/patch-2.7.1-r1/work/patch-2.7.1/tests'
PASS: asymmetric-hunks
PASS: backup-prefix-suffix
PASS: bad-filenames
PASS: concat-git-diff
PASS: copy-rename
PASS: corrupt-reject-files
PASS: create-delete
PASS: create-directory
PASS: criss-cross
FAIL: crlf-handling
XFAIL: dash-o-append
PASS: empty-files
PASS: fifo
PASS: file-modes
PASS: filename-choice
PASS: git-binary-diff
PASS: global-reject-files
PASS: inname
PASS: line-numbers
PASS: merge
PASS: mangled-numbers-abort
PASS: mixed-patch-types
PASS: munged-context-format
FAIL: need-filename
PASS: no-newline-triggers-assert
PASS: preserve-c-function-names
PASS: preserve-mode-and-timestamp
PASS: quoted-filenames
SKIP: read-only-files
PASS: reject-format
PASS: remember-backup-files
PASS: remember-reject-files
PASS: symlinks
PASS: unmodified-files
==================================
2 of 33 tests failed
(1 test was not run)
See tests/test-suite.log
Please report to bug-patch@gnu.org
==================================
make[4]: *** [test-suite.log] Error 1
make[4]: Leaving directory `/var/tmp/portage/sys-devel/patch-2.7.1-r1/work/patch-2.7.1/tests'
make[3]: *** [check-TESTS] Error 2
make[3]: Leaving directory `/var/tmp/portage/sys-devel/patch-2.7.1-r1/work/patch-2.7.1/tests'
make[2]: *** [check-am] Error 2
make[2]: Leaving directory `/var/tmp/portage/sys-devel/patch-2.7.1-r1/work/patch-2.7.1/tests'
make[1]: *** [check-recursive] Error 1
make[1]: Leaving directory `/var/tmp/portage/sys-devel/patch-2.7.1-r1/work/patch-2.7.1'
make: *** [check] Error 2
 * ERROR: sys-devel/patch-2.7.1-r1 failed (test phase):
 *   Make check failed. See above for details.



===========================================
   GNU patch 2.7.1: tests/test-suite.log   
===========================================

2 of 33 tests failed.  (1 test was not run).  

.. contents:: :depth: 2


FAIL: crlf-handling (exit: 1)
=============================

[25] patch c < ab.diff -- ok
[32] patch c < ab.diff -- ok
[39] patch c < ab.diff -- ok
[49] patch c < ab.ed -- FAILED
--- expected
+++ got
@@ -1 +1,2 @@
-
+sh: /var/tmp/portage/sys-devel/patch-2.7.1-r1/image/: No such file or directory
+/var/tmp/portage/sys-devel/patch-2.7.1-r1/work/patch-2.7.1/src/patch: **** /var/tmp/portage/sys-devel/patch-2.7.1-r1/image/ FAILED
[59] patch c < ab.diff -- ok
[63] cat -ve c -- ok
[71] patch c < ab.diff -- ok
[75] cat -ve c -- ok
[83] patch c < ab.diff -- ok
[87] cat -ve c -- ok
[98] patch c < ab.diff -- FAILED
--- expected
+++ got
@@ -1 +1,2 @@
-
+sh: /var/tmp/portage/sys-devel/patch-2.7.1-r1/image/: No such file or directory
+/var/tmp/portage/sys-devel/patch-2.7.1-r1/work/patch-2.7.1/src/patch: **** /var/tmp/portage/sys-devel/patch-2.7.1-r1/image/ FAILED
[101] cat -ve c -- FAILED
--- expected
+++ got
@@ -1 +1 @@
-1b^M$
+1^M$
[113] patch --binary c < ab.diff || echo status: $? -- ok
[120] patch c < ab.diff -- ok
[125] cat -ve c -- ok
[130] patch --binary c < ab.diff -- ok
[134] cat -ve c -- ok
[142] patch c < ab.diff -- ok
[147] cat -ve c -- ok
[152] patch --binary c < ab.diff -- ok
[156] cat -ve c -- ok
[164] patch c < ab.diff -- ok
[169] cat -ve c -- ok
[174] patch --binary c < ab.diff -- ok
[178] cat -ve c -- ok
[199] patch c < ab.diff -- ok
[203] cat -ve c -- ok
27 tests (24 passed, 3 failed)

FAIL: need-filename (exit: 1)
=============================

[23] patch < n.diff || echo "Status: $?" -- ok
[28] patch -f -n < n.diff || echo "Status: $?" -- ok
[36] patch f < n.diff -- ok
[51] patch < e.diff || echo "Status: $?" -- ok
[56] patch -f -e < e.diff || echo "Status: $?" -- ok
[64] patch f < e.diff -- FAILED
--- expected
+++ got
@@ -1 +1,2 @@
-
+sh: /var/tmp/portage/sys-devel/patch-2.7.1-r1/image/: No such file or directory
+/var/tmp/portage/sys-devel/patch-2.7.1-r1/work/patch-2.7.1/src/patch: **** /var/tmp/portage/sys-devel/patch-2.7.1-r1/image/ FAILED
[66] cat f -- FAILED
--- expected
+++ got
@@ -1 +1 @@
-one
+
[83] patch < h+c.diff -- ok
[87] cat f -- ok
[93] patch < c.diff || echo "Status: $?" -- ok
[99] patch f < c.diff -- ok
[103] cat f -- ok
[117] patch < h+u.diff -- ok
[121] cat f -- ok
[127] patch < u.diff || echo "Status: $?" -- ok
[133] patch f < u.diff -- ok
[137] cat f -- ok
17 tests (15 passed, 2 failed)

SKIP: read-only-files (exit: 77)
================================

Files with read-only permissions are writable (probably running as superuser)
Comment 1 Patrick Lauer gentoo-dev 2012-11-15 09:09:51 UTC
Portage 2.1.11.31 (default/linux/amd64/10.0, gcc-4.6.3, glibc-2.16.0, 3.5.4-vs2.3.4.3 x86_64)
=================================================================
System uname: Linux-3.5.4-vs2.3.4.3-x86_64-AMD_Phenom-tm-_II_X4_965_Processor-with-gentoo-2.2
Timestamp of tree: Unknown
ld GNU ld (GNU Binutils) 2.22.90.20120727
app-shells/bash:          4.2_p37
dev-lang/python:          2.7.3-r2, 3.2.3-r1
dev-util/cmake:           2.8.9-r1
dev-util/pkgconfig:       0.27.1
sys-apps/baselayout:      2.2
sys-apps/openrc:          0.11.2
sys-apps/sandbox:         2.6
sys-devel/autoconf:       2.69
sys-devel/automake:       1.12.4
sys-devel/binutils:       2.22.90
sys-devel/gcc:            4.6.3
sys-devel/gcc-config:     1.7.3
sys-devel/libtool:        2.4.2
sys-devel/make:           3.82-r4
sys-kernel/linux-headers: 3.6 (virtual/os-headers)
sys-libs/glibc:           2.16.0
Repositories: gentoo
ACCEPT_KEYWORDS="amd64 ~amd64"
ACCEPT_LICENSE="*"
CBUILD="x86_64-pc-linux-gnu"
CFLAGS="-O2 -pipe"
CHOST="x86_64-pc-linux-gnu"
CONFIG_PROTECT="/etc /usr/share/config /usr/share/gnupg/qualified.txt /usr/share/themes/oxygen-gtk/gtk-2.0"
CONFIG_PROTECT_MASK="/etc/ca-certificates.conf /etc/env.d /etc/fonts/fonts.conf /etc/gconf /etc/gentoo-release /etc/revdep-rebuild /etc/sandbox.d /etc/terminfo /etc/texmf/language.dat.d /etc/texmf/language.def.d /etc/texmf/updmap.d /etc/texmf/web2c"
CXXFLAGS="-O2 -pipe"
DISTDIR="/usr/portage/distfiles"
FCFLAGS="-O2 -pipe"
FEATURES="assume-digests binpkg-logs buildpkg config-protect-if-modified distlocks ebuild-locks fixlafiles merge-sync news parallel-fetch protect-owned sandbox sfperms strict test unknown-features-warn unmerge-logs unmerge-orphans userfetch"
FFLAGS="-O2 -pipe"
GENTOO_MIRRORS="http://distfiles.gentoo.org"
LANG="POSIX"
LDFLAGS="-Wl,-O1 -Wl,--as-needed"
MAKEOPTS="-j4"
PKGDIR="/usr/portage/packages"
PORTAGE_CONFIGROOT="/"
PORTAGE_RSYNC_OPTS="--recursive --links --safe-links --perms --times --compress --force --whole-file --delete --stats --human-readable --timeout=180 --exclude=/distfiles --exclude=/local --exclude=/packages"
PORTAGE_TMPDIR="/var/tmp"
PORTDIR="/usr/portage"
PORTDIR_OVERLAY=""
SYNC="rsync://rsync.gentoo.org/gentoo-portage"
USE="acl amd64 berkdb bzip2 cli cracklib crypt cups cxx dri egl fortran gdbm gpm iconv ipv6 mmx modules mudflap multilib ncurses nls nptl openmp openvg pam pcre pppd readline session sqlite sse sse2 ssl tcpd unicode xa xvfb zlib" ALSA_CARDS="ali5451 als4000 atiixp atiixp-modem bt87x ca0106 cmipci emu10k1x ens1370 ens1371 es1938 es1968 fm801 hda-intel intel8x0 intel8x0m maestro3 trident usb-audio via82xx via82xx-modem ymfpci" ALSA_PCM_PLUGINS="adpcm alaw asym copy dmix dshare dsnoop empty extplug file hooks iec958 ioplug ladspa lfloat linear meter mmap_emul mulaw multi null plug rate route share shm softvol" APACHE2_MODULES="authn_core authz_core socache_shmcb unixd actions alias auth_basic authn_alias authn_anon authn_dbm authn_default authn_file authz_dbm authz_default authz_groupfile authz_host authz_owner authz_user autoindex cache cgi cgid dav dav_fs dav_lock deflate dir disk_cache env expires ext_filter file_cache filter headers include info log_config logio mem_cache mime mime_magic negotiation rewrite setenvif speling status unique_id userdir usertrack vhost_alias" CALLIGRA_FEATURES="kexi words flow plan sheets stage tables krita karbon braindump" CAMERAS="ptp2" COLLECTD_PLUGINS="df interface irq load memory rrdtool swap syslog" ELIBC="glibc" GPSD_PROTOCOLS="ashtech aivdm earthmate evermore fv18 garmin garmintxt gpsclock itrax mtk3301 nmea ntrip navcom oceanserver oldstyle oncore rtcm104v2 rtcm104v3 sirf superstar2 timing tsip tripmate tnt ubx" INPUT_DEVICES="keyboard mouse evdev" KERNEL="linux" LCD_DEVICES="bayrad cfontz cfontz633 glk hd44780 lb216 lcdm001 mtxorb ncurses text" LIBREOFFICE_EXTENSIONS="presenter-console presenter-minimizer" PHP_TARGETS="php5-3" PYTHON_TARGETS="python2_7 python3_2" RUBY_TARGETS="ruby19" USERLAND="GNU" VIDEO_CARDS="vesa" XTABLES_ADDONS="quota2 psd pknock lscan length2 ipv4options ipset ipp2p iface geoip fuzzy condition tee tarpit sysrq steal rawnat logmark ipmark dhcpmac delude chaos account"
Unset:  CPPFLAGS, CTARGET, EMERGE_DEFAULT_OPTS, INSTALL_MASK, LC_ALL, LINGUAS, PORTAGE_BUNZIP2_COMMAND, PORTAGE_COMPRESS, PORTAGE_COMPRESS_FLAGS, PORTAGE_RSYNC_EXTRA_OPTS, USE_PYTHON
Comment 2 SpanKY gentoo-dev 2012-11-17 08:01:57 UTC
what is your /bin/sh ?
Comment 3 Andreas Sturmlechner gentoo-dev 2013-05-18 15:51:20 UTC
Exactly the same failures here.

/bin/sh -> bash

With 2.7.1 both FAILS don't happen.
Comment 4 SpanKY gentoo-dev 2013-05-21 21:20:16 UTC
Roman figured out the problem here, so dupe to the bug where he triaged things

*** This bug has been marked as a duplicate of bug 470210 ***