Gentoo Websites Logo
Go to: Gentoo Home Documentation Forums Lists Bugs Planet Store Wiki Get Gentoo!
Bug 413935 - =app-text/qpdf-2.3.1 not compiles with gcc-4.7
Summary: =app-text/qpdf-2.3.1 not compiles with gcc-4.7
Alias: None
Product: Gentoo Linux
Classification: Unclassified
Component: Current packages (show other bugs)
Hardware: AMD64 Linux
: Normal normal (vote)
Assignee: Tim Harder
Depends on:
Blocks: gcc-4.7
  Show dependency tree
Reported: 2012-04-29 04:26 UTC by David Kredba
Modified: 2012-05-23 01:14 UTC (History)
0 users

See Also:
Package list:
Runtime testing required: ---


Note You need to log in before you can comment on or make changes to this bug.
Description David Kredba 2012-04-29 04:26:04 UTC
/bin/sh ./libtool --quiet --mode=compile x86_64-pc-linux-gnu-g++  -O2 -pipe -ggdb -march=native -Wall -MD -MF libqpdf/build/QPDFObjectHandle.t
dep -MP -Iinclude -Ilibqpdf -c libqpdf/ -o libqpdf/build/QPDFObjectHandle.o; sed -e 's/\.o:/.lo:/' < libqpdf/build/QPDFObje
ctHandle.tdep > libqpdf/build/QPDFObjectHandle.dep
In file included from libqpdf/
include/qpdf/QPDFExc.hh:22:6: error: ‘off_t’ has not been declared
include/qpdf/QPDFExc.hh:44:5: error: ‘off_t’ does not name a type
include/qpdf/QPDFExc.hh:51:7: error: ‘off_t’ has not been declared
include/qpdf/QPDFExc.hh:57:5: error: ‘off_t’ does not name a type
libqpdf/ error: prototype for ‘QPDFExc::QPDFExc(qpdf_error_code_e, const string&, const string&, off_t, const string&)’ does no
t match any in class ‘QPDFExc’
In file included from libqpdf/
include/qpdf/QPDFExc.hh:15:7: error: candidates are: QPDFExc::QPDFExc(const QPDFExc&)
include/qpdf/QPDFExc.hh:19:5: error:                 QPDFExc::QPDFExc(qpdf_error_code_e, const string&, const string&, int, const string&)
libqpdf/ error: prototype for ‘std::string QPDFExc::createWhat(const string&, const string&, off_t, const string&)’ does not m
atch any in class ‘QPDFExc’
In file included from libqpdf/
include/qpdf/QPDFExc.hh:49:24: error: candidate is: static std::string QPDFExc::createWhat(const string&, const string&, int, const string&)
libqpdf/ error: no ‘off_t QPDFExc::getFilePosition() const’ member function declared in class ‘QPDFExc’
/bin/sh: libqpdf/build/QPDFExc.tdep: Adresář nebo soubor neexistuje
make: *** [libqpdf/build/QPDFExc.lo] Error 1
make: *** Waiting for unfinished jobs....
In file included from libqpdf/
include/qpdf/QPDFObjectHandle.hh:329:36: error: ‘off_t’ has not been declared
include/qpdf/QPDFObjectHandle.hh:373:32: error: ‘off_t’ has not been declared
libqpdf/ error: prototype for ‘QPDFObjectHandle QPDFObjectHandle::newStream(QPDF*, int, int, QPDFObjectHandle, off_t
, int)’ does not match any in class ‘QPDFObjectHandle’
In file included from libqpdf/
include/qpdf/QPDFObjectHandle.hh:371:29: error: candidates are: static QPDFObjectHandle QPDFObjectHandle::newStream(QPDF*, int, int, QPDFObjec
tHandle, int, int)
include/qpdf/QPDFObjectHandle.hh:136:29: error:                 static QPDFObjectHandle QPDFObjectHandle::newStream(QPDF*, PointerHolder<Buffe
include/qpdf/QPDFObjectHandle.hh:120:29: error:                 static QPDFObjectHandle QPDFObjectHandle::newStream(QPDF*)
/bin/sh: libqpdf/build/QPDFObjectHandle.tdep: Adresář nebo soubor neexistuje
make: *** [libqpdf/build/QPDFObjectHandle.lo] Error 1
 .[31;01m*.[0m ERROR: app-text/qpdf-2.3.1 failed (compile phase):
 .[31;01m*.[0m   emake failed
Comment 1 David Kredba 2012-05-06 11:01:09 UTC
Portage 2.2.0_alpha101 (default/linux/amd64/10.0/desktop, gcc-4.7.0, glibc-2.15-r1, 3.3.4-gentoo x86_64)
System uname: Linux-3.3.4-gentoo-x86_64-Intel-R-_Core-TM-2_Quad_CPU_Q9550_@_2.83GHz-with-gentoo-2.1
Timestamp of tree: Sun, 06 May 2012 09:00:02 +0000
app-shells/bash:          4.2_p28
dev-java/java-config:     2.1.11-r3
dev-lang/python:          2.7.3-r2, 3.2.3-r1
dev-util/cmake:           2.8.8-r1
dev-util/pkgconfig:       0.26
sys-apps/baselayout:      2.1
sys-apps/sandbox:         2.5
sys-devel/autoconf:       2.13, 2.69
sys-devel/automake:       1.9.6-r3, 1.10.3, 1.11.5
sys-devel/binutils:       2.22-r1
sys-devel/gcc:            4.6.3, 4.7.0
sys-devel/gcc-config:     1.7
sys-devel/libtool:        2.4.2
sys-devel/make:           3.82-r3
sys-kernel/linux-headers: 3.3 (virtual/os-headers)
sys-libs/glibc:           2.15-r1
Repositories: gentoo
Installed sets: 
ACCEPT_KEYWORDS="amd64 ~amd64"
CFLAGS="-O2 -pipe -ggdb -march=native"
CONFIG_PROTECT="/etc /usr/share/config /usr/share/gnupg/qualified.txt /usr/share/themes/oxygen-gtk/gtk-2.0 /var/bind /var/lib/hsqldb"
CONFIG_PROTECT_MASK="/etc/ca-certificates.conf /etc/env.d /etc/env.d/java/ /etc/fonts/fonts.conf /etc/gconf /etc/gentoo-release /etc/php/apache2-php5.4/ext-active/ /etc/php/cgi-php5.4/ext-active/ /etc/php/cli-php5.4/ext-active/ /etc/revdep-rebuild /etc/sandbox.d /etc/terminfo /etc/texmf/language.dat.d /etc/texmf/language.def.d /etc/texmf/updmap.d /etc/texmf/web2c"
CXXFLAGS="-O2 -pipe -ggdb -march=native"
FEATURES="assume-digests binpkg-logs compressdebug distlocks ebuild-locks fixlafiles news parallel-fetch preserve-libs protect-owned sandbox sfperms splitdebug strict unknown-features-warn unmerge-logs unmerge-orphans userfetch xattr"
FFLAGS="-O2 -pipe -ggdb -march=native"
LDFLAGS="-Wl,-O1 -Wl,--as-needed"
LINGUAS="cs en"
PORTAGE_RSYNC_OPTS="--recursive --links --safe-links --perms --times --compress --force --whole-file --delete --stats --human-readable --timeout=180 --exclude=/distfiles --exclude=/local --exclude=/packages"
USE="X a52 aac acl acpi alsa amd64 berkdb bluetooth branding bzip2 cairo caps cdda cdr cli consolekit cracklib crypt cups cxx dbus dri dts dvd dvdr emboss encode exif fam firefox flac fortran gdbm gdu gif gmp gpm gtk iconv idn ithreads java jpeg jpeg2k kde lcms ldap libnotify lzma mad mmx mng modules mp3 mp4 mpeg mudflap multilib ncurses nls nptl nptlonly objc objc++ objc-gc odbc ogg openexr opengl openmp pam pango pcre pdf png policykit ppds pppd qt3support qt4 quad readline samba sasl sdl session slang speex spell sqlite sse sse2 sse4_1 ssl ssse3 startup-notification svg sysfs tcl tcpd threads tiff tk truetype udev unicode usb v4l vorbis wavpack wxwidgets x264 xattr xcb xinerama xml xorg xv xvid xvmc zlib" ALSA_CARDS="ali5451 als4000 atiixp atiixp-modem bt87x ca0106 cmipci emu10k1x ens1370 ens1371 es1938 es1968 fm801 hda-intel intel8x0 intel8x0m maestro3 trident usb-audio via82xx via82xx-modem ymfpci" ALSA_PCM_PLUGINS="adpcm alaw asym copy dmix dshare dsnoop empty extplug file hooks iec958 ioplug ladspa lfloat linear meter mmap_emul mulaw multi null plug rate route share shm softvol" APACHE2_MODULES="actions alias auth_basic authn_alias authn_anon authn_dbm authn_default authn_file authz_dbm authz_default authz_groupfile authz_host authz_owner authz_user autoindex cache cgi cgid dav dav_fs dav_lock deflate dir disk_cache env expires ext_filter file_cache filter headers include info log_config logio mem_cache mime mime_magic negotiation rewrite setenvif speling status unique_id userdir usertrack vhost_alias" APACHE2_MPMS="worker" CALLIGRA_FEATURES="kexi words flow plan sheets stage tables krita karbon braindump" CAMERAS="ptp2 canon hp215 sony_dscf1 sony_dscf55" COLLECTD_PLUGINS="df interface irq load memory rrdtool swap syslog" ELIBC="glibc" FFTOOLS="aviocat cws2fws ffeval graph2dot ismindex pktdumper qt-faststart trasher" GPSD_PROTOCOLS="ashtech aivdm earthmate evermore fv18 garmin garmintxt gpsclock itrax mtk3301 nmea ntrip navcom oceanserver oldstyle oncore rtcm104v2 rtcm104v3 sirf superstar2 timing tsip tripmate tnt ubx" GRUB_PLATFORMS="pc" INPUT_DEVICES="evdev keyboard mouse" KERNEL="linux" LCD_DEVICES="bayrad cfontz cfontz633 glk hd44780 lb216 lcdm001 mtxorb ncurses text" LIBREOFFICE_EXTENSIONS="presenter-console presenter-minimizer" LINGUAS="cs en" LIRC_DEVICES="inputlirc pctv hauppauge hauppauge_dvb devinput" PHP_TARGETS="php5-4" RUBY_TARGETS="ruby18" USERLAND="GNU" VIDEO_CARDS="nouveau" XTABLES_ADDONS="quota2 psd pknock lscan length2 ipv4options ipset ipp2p iface geoip fuzzy condition tee tarpit sysrq steal rawnat logmark ipmark dhcpmac delude chaos account"
Comment 2 David Kredba 2012-05-06 11:03:09 UTC
Google found OpenSUSE patch:

++++++ qpdf-gcc47.patch ++++++
Index: qpdf-2.3.1/include/qpdf/QPDFExc.hh
--- qpdf-2.3.1.orig/include/qpdf/QPDFExc.hh
+++ qpdf-2.3.1/include/qpdf/QPDFExc.hh
@@ -8,6 +8,7 @@
 #ifndef __QPDFEXC_HH__
 #define __QPDFEXC_HH__+#include <unistd.h>
 #include <qpdf/DLL.h>
 #include <qpdf/Constants.h>
 #include <stdexcept>
Index: qpdf-2.3.1/include/qpdf/QPDFObjectHandle.hh
--- qpdf-2.3.1.orig/include/qpdf/QPDFObjectHandle.hh
+++ qpdf-2.3.1/include/qpdf/QPDFObjectHandle.hh
@@ -12,6 +12,7 @@
 #include <vector>
 #include <set>
 #include <map>
+#include <unistd.h> #include <qpdf/DLL.h>-- 
To unsubscribe, e-mail: 

Comment 3 David Kredba 2012-05-06 11:06:39 UTC
It compiles with the patch applied.
Comment 4 Tim Harder gentoo-dev 2012-05-23 01:14:09 UTC
Fixed in CVS.