Gentoo Websites Logo
Go to: Gentoo Home Documentation Forums Lists Bugs Planet Store Wiki Get Gentoo!
Bug 403631 - net-dialup/lrzsz-0.12.20-r3 doesn't honor LINGUAS for locale files
Summary: net-dialup/lrzsz-0.12.20-r3 doesn't honor LINGUAS for locale files
Status: UNCONFIRMED
Alias: None
Product: Gentoo Linux
Classification: Unclassified
Component: Current packages (show other bugs)
Hardware: All Linux
: Normal normal with 1 vote (vote)
Assignee: Embedded Gentoo Team
URL:
Whiteboard:
Keywords:
Depends on:
Blocks: respect_LINGUAS
  Show dependency tree
 
Reported: 2012-02-14 15:40 UTC by Piotr Szymaniak
Modified: 2016-01-22 08:30 UTC (History)
0 users

See Also:
Package list:
Runtime testing required: ---


Attachments

Note You need to log in before you can comment on or make changes to this bug.
Description Piotr Szymaniak 2012-02-14 15:40:23 UTC
When package is emerged, it dumps LC_MESSAGES for many languages, whereas I have the line 'LINGUAS="en"' in make.conf.

Actual Results:  
LC_MESSAGES contains unwanted files

Expected Results:  
LC_MESSAGES should contain only files for selected LINGUAS


rekowered ~ # equery f net-dialup/lrzsz | grep 'locale.*mo'
/usr/share/locale/de/LC_MESSAGES/lrzsz.mo




$ emerge --info net-dialup/lrzsz
Portage 2.1.10.46 (default/linux/x86/10.0, gcc-4.6.2, glibc-2.14.1-r2, 3.2.5 i686)
=================================================================
                        System Settings
=================================================================
System uname: Linux-3.2.5-i686-Intel-R-_Pentium-R-_4_CPU_2.60GHz-with-gentoo-2.1
Timestamp of tree: Tue, 14 Feb 2012 09:15:01 +0000
distcc 3.1 i686-pc-linux-gnu [disabled]
app-shells/bash:          4.2_p20
dev-lang/python:          2.7.2-r3, 3.2.2
dev-util/cmake:           2.8.7-r3
dev-util/pkgconfig:       0.26
sys-apps/baselayout:      2.1
sys-apps/openrc:          0.9.8.4
sys-apps/sandbox:         2.5
sys-devel/autoconf:       2.68
sys-devel/automake:       1.11.3
sys-devel/binutils:       2.22-r1
sys-devel/gcc:            4.6.2
sys-devel/gcc-config:     1.5-r2
sys-devel/libtool:        2.4.2
sys-devel/make:           3.82-r3
sys-kernel/linux-headers: 3.2 (virtual/os-headers)
sys-libs/glibc:           2.14.1-r2
Repositories: gentoo
ACCEPT_KEYWORDS="x86 ~x86"
ACCEPT_LICENSE="* -@EULA"
CBUILD="i686-pc-linux-gnu"
CFLAGS="-Os -march=pentium4 -pipe"
CHOST="i686-pc-linux-gnu"
CONFIG_PROTECT="/etc"
CONFIG_PROTECT_MASK="/etc/ca-certificates.conf /etc/env.d /etc/fonts/fonts.conf /etc/gconf /etc/gentoo-release /etc/revdep-rebuild /etc/sandbox.d /etc/terminfo"
CXXFLAGS="-Os -march=pentium4 -pipe"
DISTDIR="/usr/portage/distfiles"
EMERGE_DEFAULT_OPTS="--load-average 5 --jobs 3"
FEATURES="assume-digests binpkg-logs distlocks ebuild-locks fixlafiles news parallel-fetch protect-owned sandbox sfperms strict unknown-features-warn unmerge-logs unmerge-orphans userfetch"
FFLAGS=""
GENTOO_MIRRORS="http://distfiles.ift.uni.wroc.pl/"
LANG="en_US.UTF-8"
LDFLAGS="-Wl,-O1 -Wl,--as-needed"
LINGUAS="en"
MAKEOPTS="-j3"
PKGDIR="/usr/portage/packages"
PORTAGE_CONFIGROOT="/"
PORTAGE_RSYNC_OPTS="--recursive --links --safe-links --perms --times --compress --force --whole-file --delete --stats --human-readable --timeout=180 --exclude=/distfiles --exclude=/local --exclude=/packages"
PORTAGE_TMPDIR="/var/tmp"
PORTDIR="/usr/portage"
PORTDIR_OVERLAY=""
SYNC="rsync://rsync1.pl.gentoo.org/gentoo-portage"
USE="acl berkdb bzip2 cli cracklib crypt cups cxx dri fortran gdbm gpm iconv ipv6 modules mudflap ncurses nls nptl nptlonly openmp pam pcre pppd readline session ssl sysfs tcpd unicode x86 xorg zlib" ALSA_CARDS="ali5451 als4000 atiixp atiixp-modem bt87x ca0106 cmipci emu10k1 emu10k1x ens1370 ens1371 es1938 es1968 fm801 hda-intel intel8x0 intel8x0m maestro3 trident usb-audio via82xx via82xx-modem ymfpci" ALSA_PCM_PLUGINS="adpcm alaw asym copy dmix dshare dsnoop empty extplug file hooks iec958 ioplug ladspa lfloat linear meter mmap_emul mulaw multi null plug rate route share shm softvol" APACHE2_MODULES="actions alias auth_basic authn_alias authn_anon authn_dbm authn_default authn_file authz_dbm authz_default authz_groupfile authz_host authz_owner authz_user autoindex cache cgi cgid dav dav_fs dav_lock deflate dir disk_cache env expires ext_filter file_cache filter headers include info log_config logio mem_cache mime mime_magic negotiation rewrite setenvif speling status unique_id userdir usertrack vhost_alias" CALLIGRA_FEATURES="kexi words flow plan stage tables krita karbon braindump" CAMERAS="ptp2" COLLECTD_PLUGINS="df interface irq load memory rrdtool swap syslog" ELIBC="glibc" GPSD_PROTOCOLS="ashtech aivdm earthmate evermore fv18 garmin garmintxt gpsclock itrax mtk3301 nmea ntrip navcom oceanserver oldstyle oncore rtcm104v2 rtcm104v3 sirf superstar2 timing tsip tripmate tnt ubx" INPUT_DEVICES="keyboard mouse evdev" KERNEL="linux" LCD_DEVICES="bayrad cfontz cfontz633 glk hd44780 lb216 lcdm001 mtxorb ncurses text" LINGUAS="en" PHP_TARGETS="php5-3" RUBY_TARGETS="ruby18" USERLAND="GNU" VIDEO_CARDS="fbdev glint intel mach64 mga neomagic nouveau nv r128 radeon savage sis tdfx trident vesa via vmware dummy v4l" XTABLES_ADDONS="quota2 psd pknock lscan length2 ipv4options ipset ipp2p iface geoip fuzzy condition tee tarpit sysrq steal rawnat logmark ipmark dhcpmac delude chaos account"
Unset:  CPPFLAGS, CTARGET, INSTALL_MASK, LC_ALL, PORTAGE_BUNZIP2_COMMAND, PORTAGE_COMPRESS, PORTAGE_COMPRESS_FLAGS, PORTAGE_RSYNC_EXTRA_OPTS

=================================================================
                        Package Settings
=================================================================

net-dialup/lrzsz-0.12.20-r3 was built with the following:
USE="nls"
CFLAGS="-Os -march=pentium4 -pipe -Wstrict-prototypes"
CXXFLAGS="-Os -march=pentium4 -pipe -Wstrict-prototypes"
Comment 1 Jeroen Roovers gentoo-dev 2012-02-14 16:18:15 UTC
Um, this is taking it a bit too far. If you made it your project to go through the entire tree to look for packages that do not honour LINGUAS, you're going about it the wrong way.

Stop filing these bugs now or only file them for packages you show a clear personal interest for.
Comment 2 Geoff Madden 2012-06-11 05:14:15 UTC
My problem is,aclocal is falling over in this way

cd . && aclocal
acinclude.m4:2: warning: underquoted definition of AC_REPLACE_GNU_GETOPT
acinclude.m4:2:   run info Automake 'Extending aclocal'
acinclude.m4:2:   or see http://www.gnu.org/software/automake/manual/automake.html#Extending-aclocal
configure.in:100: error: automatic de-ANSI-fication support has been removed
/usr/share/aclocal-1.12/protos.m4:12: AM_C_PROTOTYPES is expanded from...
configure.in:100: the top level
autom4te-2.69: /usr/bin/m4 failed with exit status: 1
aclocal-1.12: error: autom4te failed with exit status: 1
make: *** [aclocal.m4] Error 1
schrdlu-12
 I tried making the changes suggested when running autoconf,but this wasn't all that helpful either.

I apparantly need lrszs to run minicom,so I can check which of my usb ports is which ,I have an ax25modem on one and my gps on the other. Any suggestions ??
Comment 3 Geoff Madden 2012-06-11 05:25:17 UTC
This is the result of running automake

configure.in:100: warning: AC_C_INLINE was called before AM_PROG_CC_STDC
aclocal.m4:253: AM_PROG_CC_STDC is expanded from...
aclocal.m4:216: AM_C_PROTOTYPES is expanded from...
configure.in:100: the top level
configure.in:100: warning: AC_C_CONST was called before AM_PROG_CC_STDC
aclocal.m4:253: AM_PROG_CC_STDC is expanded from...
aclocal.m4:216: AM_C_PROTOTYPES is expanded from...
configure.in:100: the top level
configure.in:3: error: your implementation of AM_INIT_AUTOMAKE comes from an
configure.in:3: old Automake version.  You should recreate aclocal.m4
configure.in:3: with aclocal and run automake again
Makefile.am:34: warning: '%'-style pattern rules are a GNU make extension
Makefile.am:35: warning: subst vcheck-,,$@: non-POSIX variable name
Makefile.am:35: (probably a GNU make extension)
Makefile.am:36: warning: '%'-style pattern rules are a GNU make extension
Makefile.am:37: warning: subst check-,,$@: non-POSIX variable name
Makefile.am:37: (probably a GNU make extension)
lib/Makefile.am:2: error: automatic de-ANSI-fication support has been removed
lib/Makefile.am: error: required file './depcomp' not found
lib/Makefile.am:   'automake --add-missing' can install 'depcomp'
/usr/share/automake-1.12/am/depend2.am: error: am__fastdepCC does not appear in AM_CONDITIONAL
/usr/share/automake-1.12/am/depend2.am:   The usual way to define 'am__fastdepCC' is to add 'AC_PROG_CC'
/usr/share/automake-1.12/am/depend2.am:   to 'configure.in' and run 'aclocal' and 'autoconf' again
/usr/share/automake-1.12/am/depend2.am: error: AMDEP does not appear in AM_CONDITIONAL
/usr/share/automake-1.12/am/depend2.am:   The usual way to define 'AMDEP' is to add one of the compiler tests
/usr/share/automake-1.12/am/depend2.am:     AC_PROG_CC, AC_PROG_CXX, AC_PROG_OBJC, AC_PROG_OBJCXX,
/usr/share/automake-1.12/am/depend2.am:     AM_PROG_AS, AM_PROG_GCJ, AM_PROG_UPC
/usr/share/automake-1.12/am/depend2.am:   to 'configure.in' and run 'aclocal' and 'autoconf' again
src/Makefile.am:10: error: automatic de-ANSI-fication support has been removed


KLike a catch 22 automake fails suggests aclocal which also fails
Geoff