Gentoo Websites Logo
Go to: Gentoo Home Documentation Forums Lists Bugs Planet Store Wiki Get Gentoo!
Bug 399215 (glibc-2.15) - [TRACKER] Packages failing with sys-libs/glibc-2.15
Summary: [TRACKER] Packages failing with sys-libs/glibc-2.15
Status: RESOLVED FIXED
Alias: glibc-2.15
Product: Gentoo Linux
Classification: Unclassified
Component: [OLD] Core system (show other bugs)
Hardware: All Linux
: Normal normal (vote)
Assignee: Gentoo Toolchain Maintainers
URL:
Whiteboard:
Keywords: Tracker
Depends on: glibc-rpc glibc-2.14 399205 399479 409047 413685 430750
Blocks: glibc-2.16 430346
  Show dependency tree
 
Reported: 2012-01-17 22:01 UTC by SpanKY
Modified: 2012-12-27 21:35 UTC (History)
4 users (show)

See Also:
Package list:
Runtime testing required: ---


Attachments
portage-utils.build.log.gz (app-portage:portage-utils-0.9:20120213-105433.log.gz,1.65 KB, application/octet-stream)
2012-02-13 10:57 UTC, Kamen Dokov
Details
kdelibs.build.log.gz (kde-base:kdelibs-4.8.0-r1:20120213-105810.log.gz,20.81 KB, application/octet-stream)
2012-02-13 11:05 UTC, Kamen Dokov
Details
cmake.build.log (dev-util:cmake-2.8.7-r3:20120213-110746.log.gz,13.78 KB, application/octet-stream)
2012-02-13 11:21 UTC, Kamen Dokov
Details
strigi.build.log.gz (app-misc:strigi-0.7.7:20120213-112209.log.gz,14.64 KB, application/octet-stream)
2012-02-13 11:25 UTC, Kamen Dokov
Details
poppler.build.log.gz (app-text:poppler-0.18.3:20120213-112612.log.gz,8.73 KB, application/octet-stream)
2012-02-13 11:34 UTC, Kamen Dokov
Details

Note You need to log in before you can comment on or make changes to this bug.
Description SpanKY gentoo-dev 2012-01-17 22:01:56 UTC
standard tracker bug
Comment 1 Kamen Dokov 2012-02-13 10:57:03 UTC
Created attachment 301749 [details]
portage-utils.build.log.gz

app-portage/portage-utils-0.9 fails with:


In file included from libq/libq.c:37:0,
                 from main.c:97:
libq/scandirat.c:10:12: error: static declaration of ‘scandirat’ follows non-static declaration
/usr/include/dirent.h:294:12: note: previous declaration of ‘scandirat’ was here
libq/xmkdir.c:110:15: warning: ‘rmdir_r’ defined but not used
make: *** [q] Error 1
emake failed
Comment 2 Kamen Dokov 2012-02-13 11:05:05 UTC
Created attachment 301751 [details]
kdelibs.build.log.gz

kde-base/kdelibs-4.8.0-r1 failed with:

[  3%] Building C object kdecore/CMakeFiles/kdecore.dir/services/yacc.o
In file included from yacc.y:2:0:
/usr/include/include/stdlib.h:521:1: error: expected identifier or ‘(’ before ‘/’ token
/usr/include/include/stdlib.h:522:35: error: invalid suffix "x" on integer constant
/usr/include/include/stdlib.h:547:1: error: expected identifier or ‘(’ before ‘/’ token
/usr/include/include/stdlib.h:548:35: error: invalid suffix "x" on integer constant
make[2]: *** [kdecore/CMakeFiles/kdecore.dir/services/yacc.o] Error 1
make[1]: *** [kdecore/CMakeFiles/kdecore.dir/all] Error 2
make: *** [all] Error 2
Comment 3 Kamen Dokov 2012-02-13 11:06:13 UTC
Comment on attachment 301749 [details]
portage-utils.build.log.gz

>�éë8OÿuO@Åï}/s4ûC ^ê`°<uÕY\wÝ5ìÛ·Z f÷{o¼ûzËæàÝ×Q²0l/¬jX1¸bJù´u÷â»ýÎraü0fÞ_>CE[Ò¯jhBxb\Zרcø1ß}°t=æ×tüoü±}l7P4$°áPð²*êaBZ¢(]m'=/]àÕkÐvµ`òQÏùDÖ!Ýßò,½J£è;Æ%õ³7fïH���éë8Oÿ����������êë8Oÿ²³³SÍ+HLÎÎÌKW(Î/-JNÕÓÓã���ÿÿ²C/È/*ILOÕ--ÉÌ)Ö5гÔ+I,Ò«¨R(ÉWÐ/K,Ò/É-Ð*ÒO,(б14êçes���ÿÿ¶K¡lIjBfYF���ÿÿ�¶å"mÁ����ëë8Oÿ²³³S(J-H,ÊÌKW(Î/-JNUÈÌSÐ/K,Ò/É-Ð/È/*ILOÕO,(б¡´niIfN±®¥~y~Q6¦°Ð`¹`RSô¸����ÿÿ�³mFÿw����ëë8Oÿ²³³SpÎÏKËL/-ÊÌKW(Î/-JNUÈÌSÐ/K,Ò/É-Ð/È/*ILOÕO,(б¡´niIfN±®¥~y~Q6¦°���ÿÿ²Ú17jUj���ÿÿ�ôDì{����ìë8Oÿ²³³SpÎÏ-ÈÌÉÌKW(Î/-JNUÈÌSÐ/K,Ò/É-Ð/È/*ILOÕO,(б¡´niIfN±®¥~y~Q6¦°���ÿÿÊMÌNUÐÍ2Tà���ÿÿA ¿Â<ú
> bbx½vÍìîvÿhöfôäCûbXø
>jzæ±f`Çm<"ºhP¦á,/y¬Íø(î+TÜ��ÿÿ²â���ÿÿ\KÂ0D÷Â`@¨¢¡K($n)?R·ôø8+[ÏòxÆû­{tWÍ»îÓÙZBlûC2â7u;^Åí¦½`ª&²Æ÷I¸*Ê­äÚÎý@ȹ4]õBXÄ
ªÞ÷{8b<+ÌÄìØýqNæXgo8ýâBÑøtRg^���ÿÿÁ
Â0EïÂ@Ó¤ªÞ1Bª"^;¬×IHâ�|ðÁßÏßú''¦í%eüùª·VX<4Xî|WÞ{]¶Ah
u^ÌUUàDXâ°Ð9LÒ=përÿ ëòCà91í	¥§(úý©N£±°nÙxtq7ÏSüg5§���ÿÿ;¼"7(r5ÈÙ¦V@é¢<`ºµé+ÊÊÅt¥¤¦c!E!©´d0
¤p���ÿÿ¥C+---èÂXW¹����ÿÿJ'Ï´D`è¦p���ÿÿR66´60ÌÕ6ÈUp
>ò²RÀò¡Z4Á(U¡ #±8UÓ���ÿÿB3KAÅ&����ÿÿBå���ÿÿBã;'æä"#9Û���ÿÿÂ0
>RJ3sRô3t@i(b°V {ã¡Nâ���ÿÿÂnBj^YfQ~^.0z &ãnB|jbA¦Q<²A����ÿÿÂ0ìYÝÔÔ¢b$§#JÉLå���ÿÿBÓÌøÅ©ÉiÀ´SYPZþäüT+.����ÿÿ°x55 ÃR���ÿÿBK����ÿÿBã{¦)Tæ*2Bqi(u
>òÅI	Ðù¥%¥`»ÕS!®nf^Z¾-ÞhW×á���ÿÿB³d(rRKRÀQ£®�L˸ì)(,#d���ÿÿÂpXlÉ,RÉ%@/&(¨o 8¼ð«	 Yga¡¡±®¡©±±P^zÐ����ÿÿÂâ
>HòCNEÐ"
>S¯GJRJÌÚ
���ÿÿB³;ØdC±WNê\����ÿÿ�om)ü���ìë8Oÿ���������
Comment 4 Kamen Dokov 2012-02-13 11:21:29 UTC
Created attachment 301755 [details]
cmake.build.log

dev-util/cmake-2.8.7-r3 fails with

[ 81%] Building CXX object Source/CMakeFiles/ccmake.dir/CursesDialog/ccmake.cxx.o
Linking CXX executable ../bin/ccmake
kwsys/libcmsys.a(DynamicLoader.cxx.o): In function `cmsys::DynamicLoader::OpenLibrary(char const*)':
DynamicLoader.cxx:(.text+0x6): warning: Using 'dlopen' in statically linked applications requires at runtime the shared libraries from the glibc version used for linking
/usr/lib/gcc/x86_64-pc-linux-gnu/4.5.3/../../../../x86_64-pc-linux-gnu/bin/ld: cannot find /lib64/libarchive.so
collect2: ld returned 1 exit status
make[2]: *** [bin/ccmake] Error 1
make[1]: *** [Source/CMakeFiles/ccmake.dir/all] Error 2
make: *** [all] Error 2
Comment 5 Kamen Dokov 2012-02-13 11:25:36 UTC
Created attachment 301759 [details]
strigi.build.log.gz

app-misc/strigi-0.7.7 fails with:

/var/tmp/portage/app-misc/strigi-0.7.7/work/strigi-0.7.7/libstreamanalyzer/lib/endanalyzers/helperendanalyzer.cpp:161:2: warning: #warning this does not work on windows because processinputstream does not compile!
Linking CXX shared library libstreamanalyzer.so
CMakeFiles/streamanalyzer.dir/analyzerloader.cpp.o: In function `Strigi::AnalyzerLoader::Private::loadModule(char const*)':
analyzerloader.cpp:(.text+0x611): warning: Using 'dlopen' in statically linked applications requires at runtime the shared libraries from the glibc version used for linking
/usr/lib/gcc/x86_64-pc-linux-gnu/4.5.3/../../../../x86_64-pc-linux-gnu/bin/ld: /usr/lib64/lib64/libdl.a(dlsym.o): warning: relocation against `__dlsym' in readonly section `.text'.
/usr/lib/gcc/x86_64-pc-linux-gnu/4.5.3/../../../../x86_64-pc-linux-gnu/bin/ld: /usr/lib64/lib64/libdl.a(dlopen.o): relocation R_X86_64_PC32 against undefined symbol `__dlopen' can not be used when making a shared object; recompile with -fPIC
/usr/lib/gcc/x86_64-pc-linux-gnu/4.5.3/../../../../x86_64-pc-linux-gnu/bin/ld: final link failed: Bad value
collect2: ld returned 1 exit status
make[2]: *** [libstreamanalyzer/lib/libstreamanalyzer.so.0.7.7] Error 1
make[1]: *** [libstreamanalyzer/lib/CMakeFiles/streamanalyzer.dir/all] Error 2
make: *** [all] Error 2
Comment 6 Kamen Dokov 2012-02-13 11:34:27 UTC
Created attachment 301761 [details]
poppler.build.log.gz

app-text/poppler-0.18.3 fails with:


[ 54%] Building CXX object CMakeFiles/poppler.dir/poppler/JPXStream.cc.o
Linking CXX shared library libpoppler.so
/usr/lib/gcc/x86_64-pc-linux-gnu/4.5.3/../../../../x86_64-pc-linux-gnu/bin/ld: /usr/lib64/lib64/libm.a(s_sin.o): relocation R_X86_64_32S against `.rodata' can not be used when making a shared object; recompile with -fPIC
/usr/lib64/lib64/libm.a: could not read symbols: Bad value
collect2: ld returned 1 exit status
make[2]: *** [libpoppler.so.19.0.0] Error 1
make[1]: *** [CMakeFiles/poppler.dir/all] Error 2
make: *** [all] Error 2
Comment 7 SpanKY gentoo-dev 2012-02-13 18:31:16 UTC
do not report bugs here.  file new bugs per package.
Comment 8 Kamen Dokov 2012-02-14 14:37:15 UTC
Separate bugs filled:

Bug 403553 
Bug 403559
Bug 403565
Bug 403569
Bug 403571 
Bug 403583
Bug 403591
Comment 9 SpanKY gentoo-dev 2012-09-25 19:05:12 UTC
pretty much sorted now