Gentoo Websites Logo
Go to: Gentoo Home Documentation Forums Lists Bugs Planet Store Wiki Get Gentoo!
Bug 333325 - dev-scheme/guile-1.8.5-r1 fails tests
Summary: dev-scheme/guile-1.8.5-r1 fails tests
Alias: None
Product: Gentoo Linux
Classification: Unclassified
Component: New packages (show other bugs)
Hardware: All Linux
: High normal (vote)
Assignee: Scheme Project
Depends on:
Reported: 2010-08-18 17:18 UTC by Patrick Lauer
Modified: 2013-02-02 12:38 UTC (History)
2 users (show)

See Also:
Package list:
Runtime testing required: ---


Note You need to log in before you can comment on or make changes to this bug.
Description Patrick Lauer gentoo-dev 2010-08-18 17:18:19 UTC
make  check-TESTS
make[4]: Entering directory `/var/tmp/portage/dev-scheme/guile-1.8.5-r1/work/guile-1.8.5/test-suite/standalone'
PASS: test-system-cmds
PASS: test-require-extension
PASS: test-bad-identifiers
PASS: test-num2integral
PASS: test-round
PASS: test-gh
ERROR: In procedure dynamic-link:
ERROR: file: "libtest-asmobs", message: "file not found"
FAIL: test-asmobs
PASS: test-list
PASS: test-unwind
PASS: test-conversion
PASS: test-use-srfi
PASS: test-with-guile-module
1 of 12 tests failed
Please report to
make[4]: *** [check-TESTS] Error 1
make[4]: Leaving directory `/var/tmp/portage/dev-scheme/guile-1.8.5-r1/work/guile-1.8.5/test-suite/standalone'
make[3]: *** [check-am] Error 2
make[3]: Leaving directory `/var/tmp/portage/dev-scheme/guile-1.8.5-r1/work/guile-1.8.5/test-suite/standalone'
make[2]: *** [check] Error 2
make[2]: Leaving directory `/var/tmp/portage/dev-scheme/guile-1.8.5-r1/work/guile-1.8.5/test-suite/standalone'
make[1]: *** [check-recursive] Error 1
make[1]: Leaving directory `/var/tmp/portage/dev-scheme/guile-1.8.5-r1/work/guile-1.8.5/test-suite'
make: *** [check-recursive] Error 1
 * ERROR: dev-scheme/guile-1.8.5-r1 failed:

Portage (default/linux/x86/10.0, gcc-4.3.4, glibc-2.11.2-r0, 2.6.35-rc4 i686)
System uname: Linux-2.6.35-rc4-i686-AMD_Phenom-tm-_9950_Quad-Core_Processor-with-gentoo-1.12.13
Timestamp of tree: Unknown
app-shells/bash:     4.0_p37
dev-lang/python:     2.6.4-r1
sys-apps/baselayout: 1.12.13
sys-apps/sandbox:    1.6-r2
sys-devel/autoconf:  2.13, 2.65
sys-devel/automake:  1.10.3, 1.11.1
sys-devel/binutils:  2.18-r3
sys-devel/gcc:       4.3.4
sys-devel/gcc-config: 1.4.1
sys-devel/libtool:   2.2.6b
virtual/os-headers:  2.6.30-r1
CFLAGS="-O2 -march=i686 -pipe"
CONFIG_PROTECT="/etc /usr/share/X11/xkb /usr/share/config /var/bind"
CONFIG_PROTECT_MASK="/etc/ca-certificates.conf /etc/env.d /etc/env.d/java/ /etc/eselect/postgresql /etc/fonts/fonts.conf /etc/gconf /etc/gentoo-release /etc/php/apache2-php5/ext-active/ /etc/php/cgi-php5/ext-active/ /etc/php/cli-php5/ext-active/ /etc/revdep-rebuild /etc/sandbox.d /etc/terminfo /etc/texmf/language.dat.d /etc/texmf/language.def.d /etc/texmf/updmap.d /etc/texmf/web2c"
CXXFLAGS="-O2 -march=i686 -pipe"
FEATURES="assume-digests buildpkg distlocks fixpackages news parallel-fetch protect-owned sandbox sfperms strict test unmerge-logs unmerge-orphans userfetch"
LDFLAGS="-Wl,-O1 -Wl,--as-needed"
PORTAGE_RSYNC_OPTS="--recursive --links --safe-links --perms --times --compress --force --whole-file --delete --stats --timeout=180 --exclude=/distfiles --exclude=/local --exclude=/packages"
USE="X acl berkdb bzip2 cli cracklib crypt cups cxx dri fortran gcj gdbm gpm iconv ipv6 modules mudflap ncurses nls nptl nptlonly objc openmp pam pcre perl pppd python readline reflection session spl ssl sysfs tcpd unicode x86 xorg zlib" ALSA_CARDS="ali5451 als4000 atiixp atiixp-modem bt87x ca0106 cmipci emu10k1 emu10k1x ens1370 ens1371 es1938 es1968 fm801 hda-intel intel8x0 intel8x0m maestro3 trident usb-audio via82xx via82xx-modem ymfpci" ALSA_PCM_PLUGINS="adpcm alaw asym copy dmix dshare dsnoop empty extplug file hooks iec958 ioplug ladspa lfloat linear meter mmap_emul mulaw multi null plug rate route share shm softvol" APACHE2_MODULES="actions alias auth_basic authn_alias authn_anon authn_dbm authn_default authn_file authz_dbm authz_default authz_groupfile authz_host authz_owner authz_user autoindex cache cgi cgid dav dav_fs dav_lock deflate dir disk_cache env expires ext_filter file_cache filter headers include info log_config logio mem_cache mime mime_magic negotiation rewrite setenvif speling status unique_id userdir usertrack vhost_alias" ELIBC="glibc" INPUT_DEVICES="keyboard mouse evdev" KERNEL="linux" LCD_DEVICES="bayrad cfontz cfontz633 glk hd44780 lb216 lcdm001 mtxorb ncurses text" RUBY_TARGETS="ruby18" USERLAND="GNU" VIDEO_CARDS="fbdev glint intel mach64 mga neomagic nv r128 radeon savage sis tdfx trident vesa via vmware voodoo" XTABLES_ADDONS="quota2 psd pknock lscan length2 ipv4options ipset ipp2p iface geoip fuzzy condition tee tarpit sysrq steal rawnat logmark ipmark dhcpmac delude chaos account" 
Comment 1 Nikoli 2010-08-26 00:10:54 UTC
confirm same error with 1.8.5-r1 and 1.8.6:
ERROR: In procedure dynamic-link:
ERROR: file: "libtest-asmobs", message: "file not found"

It is fixed upstream:;a=commit;h=a0aa1e5b69d6ef0311aeea8e4b9a94eae18a1aaf

1.8.7 builds fine.
Comment 2 Luca Lesinigo 2010-09-02 08:45:01 UTC
same here on:
  stable amd64/hardened gcc-4.3.4
  stable hppa gcc-4.4.4-r1

dev-scheme/guile-1.8.5-r1 fails with FEATURES=test, while guile-1.8.7 emerges and runs fine. I've switched all of my systems to that version and asked for stabilization (see bug #335657) - I'm not gonna bother with 1.8.5-* anymore and I'd suggest you guys do the same.
Comment 3 Martin Walch 2010-12-30 19:53:32 UTC
Looks to me like the same as bug #295093.
Comment 4 Luca Lesinigo 2012-09-24 09:59:56 UTC
All archs that are stable for this 1.8.5-r1 are also stable for newer 1.8.x ebuilds, and all archs that are unstable for this 1.8.5-r1 are also unstable or even stable for newer ebuilds.

I think it should be fair to close this bug and maybe get rid of some older ebuilds?
Comment 5 Cyprien Nicolas (fulax) 2012-09-24 10:24:27 UTC
(In reply to comment #4)
> All archs that are stable for this 1.8.5-r1 are also stable for newer 1.8.x
> ebuilds, and all archs that are unstable for this 1.8.5-r1 are also unstable
> or even stable for newer ebuilds.
> I think it should be fair to close this bug and maybe get rid of some older
> ebuilds?

You're right, thanks for your vigilance.

The scheme herd currently lacks manpower to remove old packages (and also to add new ones). I think it is better to keep this bug open as long as guile-1.8.5 versions are still in the tree. When we will remove those versions, then this bug could be marked OBSOLETE.
Comment 6 Pacho Ramos gentoo-dev 2013-02-02 12:38:28 UTC
+  02 Feb 2013; Pacho Ramos <> -files/gcc-4.3.patch,
+  -files/guile-1.8.6-interix.patch, -files/guile-1.8.7-fix_tests.patch,
+  -files/guile-1.8.7-gcc45.patch, -files/slibtest.patch, -guile-1.6.8.ebuild,
+  -guile-1.8.4-r1.ebuild, -guile-1.8.4.ebuild, -guile-1.8.5-r1.ebuild,
+  -guile-1.8.5.ebuild, -guile-1.8.6.ebuild, -guile-1.8.7-r1.ebuild,
+  -guile-1.8.7-r2.ebuild, -guile-1.8.7.ebuild, -guile-1.8.8.ebuild,
+  metadata.xml:
+  Drop old