Gentoo Websites Logo
Go to: Gentoo Home Documentation Forums Lists Bugs Planet Store Wiki Get Gentoo!
Bug 330261 - net-libs/sofia-sip-1.12.10: torture_url test fail to pass
Summary: net-libs/sofia-sip-1.12.10: torture_url test fail to pass
Status: CONFIRMED
Alias: None
Product: Gentoo Linux
Classification: Unclassified
Component: Current packages (show other bugs)
Hardware: All Linux
: High normal (vote)
Assignee: Gentoo Linux Gnome Desktop Team
URL: http://sourceforge.net/tracker/?func=...
Whiteboard:
Keywords: TESTFAILURE
Depends on:
Blocks:
 
Reported: 2010-07-28 19:56 UTC by Pacho Ramos
Modified: 2013-10-27 10:23 UTC (History)
0 users

See Also:
Package list:
Runtime testing required: ---


Attachments
build.log (build.log,422.88 KB, text/plain)
2010-07-28 19:57 UTC, Pacho Ramos
Details

Note You need to log in before you can comment on or make changes to this bug.
Description Pacho Ramos gentoo-dev 2010-07-28 19:56:42 UTC
PASS: run_test_sdp
==================
All 2 tests passed
==================
make[4]: Leaving directory `/var/tmp/portage/net-libs/sofia-sip-1.12.10/work/sofia-sip-1.12.10/libsofia-sip-ua/sdp'
make[3]: Leaving directory `/var/tmp/portage/net-libs/sofia-sip-1.12.10/work/sofia-sip-1.12.10/libsofia-sip-ua/sdp'
make[2]: Leaving directory `/var/tmp/portage/net-libs/sofia-sip-1.12.10/work/sofia-sip-1.12.10/libsofia-sip-ua/sdp'
Making check in url
make[2]: Entering directory `/var/tmp/portage/net-libs/sofia-sip-1.12.10/work/sofia-sip-1.12.10/libsofia-sip-ua/url'
make check-am
make[3]: Entering directory `/var/tmp/portage/net-libs/sofia-sip-1.12.10/work/sofia-sip-1.12.10/libsofia-sip-ua/url'
make torture_url
make[4]: Entering directory `/var/tmp/portage/net-libs/sofia-sip-1.12.10/work/sofia-sip-1.12.10/libsofia-sip-ua/url'
if i686-pc-linux-gnu-gcc -DHAVE_CONFIG_H -I. -I. -I../.. -I../../libsofia-sip-ua/su/sofia-sip -I./../bnf -I../bnf -I./../ipt -I../ipt -I./../su -I../su -Wall -O2 -march=native -pipe -fomit-frame-pointer -ggdb -MT torture_url.o -MD -MP -MF ".deps/torture_url.Tpo" -c -o torture_url.o torture_url.c; \
then mv -f ".deps/torture_url.Tpo" ".deps/torture_url.Po"; else rm -f ".deps/torture_url.Tpo"; exit 1; fi
/bin/sh ../../libtool --tag=CC --mode=link i686-pc-linux-gnu-gcc -Wall -O2 -march=native -pipe -fomit-frame-pointer -ggdb -Wl,-O1 -Wl,--as-needed -o torture_url torture_url.o liburl.la ../bnf/libbnf.la ../ipt/libipt.la ../su/libsu.la -lssl -lcrypto -lrt -lpthread 
i686-pc-linux-gnu-gcc -Wall -O2 -march=native -pipe -fomit-frame-pointer -ggdb -Wl,-O1 -Wl,--as-needed -o torture_url torture_url.o ./.libs/liburl.a ../bnf/.libs/libbnf.a ../ipt/.libs/libipt.a ../su/.libs/libsu.a -lssl -lcrypto -lrt -lpthread 
make[4]: Leaving directory `/var/tmp/portage/net-libs/sofia-sip-1.12.10/work/sofia-sip-1.12.10/libsofia-sip-ua/url'
make check-TESTS
make[4]: Entering directory `/var/tmp/portage/net-libs/sofia-sip-1.12.10/work/sofia-sip-1.12.10/libsofia-sip-ua/url'
torture_url.c:279: torture_url test_sip() FAILED: url_query_as_header_string(home, url->url_headers) != "\n\nCANNED MSG" or NULL != "

CANNED MSG"
FAIL: torture_url
===================
1 of 1 tests failed
===================
make[4]: *** [check-TESTS] Error 1
make[4]: Leaving directory `/var/tmp/portage/net-libs/sofia-sip-1.12.10/work/sofia-sip-1.12.10/libsofia-sip-ua/url'
make[3]: *** [check-am] Error 2
make[3]: Leaving directory `/var/tmp/portage/net-libs/sofia-sip-1.12.10/work/sofia-sip-1.12.10/libsofia-sip-ua/url'
make[2]: *** [check] Error 2
make[2]: Leaving directory `/var/tmp/portage/net-libs/sofia-sip-1.12.10/work/sofia-sip-1.12.10/libsofia-sip-ua/url'
make[1]: *** [check-recursive] Error 1
make[1]: Leaving directory `/var/tmp/portage/net-libs/sofia-sip-1.12.10/work/sofia-sip-1.12.10/libsofia-sip-ua'
make: *** [check-recursive] Error 1


Reproducible: Always
Comment 1 Pacho Ramos gentoo-dev 2010-07-28 19:57:17 UTC
Created attachment 240497 [details]
build.log