Gentoo Websites Logo
Go to: Gentoo Home Documentation Forums Lists Bugs Planet Store Wiki Get Gentoo!
Bug 298014 - sys-kernel/dracut broken tests
Summary: sys-kernel/dracut broken tests
Status: CONFIRMED
Alias: None
Product: Gentoo Linux
Classification: Unclassified
Component: New packages (show other bugs)
Hardware: All Linux
: Low normal (vote)
Assignee: Patrick McLean
URL:
Whiteboard:
Keywords: LATER
Depends on:
Blocks:
 
Reported: 2009-12-22 22:11 UTC by Diego Elio Pettenò (RETIRED)
Modified: 2020-05-24 09:41 UTC (History)
3 users (show)

See Also:
Package list:
Runtime testing required: ---


Attachments
Build log (dracut-003:20091222-162318.log,7.25 KB, text/plain)
2009-12-22 22:11 UTC, Diego Elio Pettenò (RETIRED)
Details
dracut-007.ebuild (dracut-007-r1.ebuild,4.88 KB, text/plain)
2010-08-25 19:19 UTC, Amadeusz Żołnowski (RETIRED)
Details

Note You need to log in before you can comment on or make changes to this bug.
Description Diego Elio Pettenò (RETIRED) gentoo-dev 2009-12-22 22:11:19 UTC
Portage 2.1.7.15 (default/linux/x86/10.0, gcc-4.4.2-asneeded, glibc-2.11-r1, 2.6.32.2 i686)
=================================================================
System uname: Linux-2.6.32.2-i686-Quad-Core_AMD_Opteron-tm-_Processor_2350-with-gentoo-2.0.1
Timestamp of tree: Sat, 19 Dec 2009 14:30:01 +0000
ccache version 2.4 [disabled]
app-shells/bash:     4.0_p35
dev-java/java-config: 1.3.7-r1, 2.1.10
dev-lang/python:     2.6.4, 3.1.1-r1
dev-python/pycrypto: 2.1.0
dev-util/ccache:     2.4-r8
dev-util/cmake:      2.8.0
sys-apps/baselayout: 2.0.1
sys-apps/openrc:     0.5.3
sys-apps/sandbox:    2.2
sys-devel/autoconf:  2.13, 2.65
sys-devel/automake:  1.4_p6-r1, 1.5-r1, 1.6.3-r1, 1.7.9-r2, 1.8.5-r4, 1.9.6-r3, 1.10.3, 1.11.1
sys-devel/binutils:  2.20
sys-devel/gcc-config: 1.4.1
sys-devel/libtool:   2.2.6b
virtual/os-headers:  2.6.30-r1
ACCEPT_KEYWORDS="x86 ~x86"
ACCEPT_LICENSE="*"
CBUILD="i686-pc-linux-gnu"
CFLAGS="-O2 -pipe"
CHOST="i686-pc-linux-gnu"
CONFIG_PROTECT="/etc /opt/openfire/resources/security/ /opt/openjms/config /usr/lib/ccs/conf /usr/lib/fax /usr/share/X11/xkb /usr/share/bufrtables /usr/share/config /usr/share/qpsmtpd/plugins /var/bind /var/lib/hsqldb /var/phxd /var/qmail/alias /var/qmail/control /var/spool/fax/etc /var/spool/torque /var/vpopmail/etc"
CONFIG_PROTECT_MASK="/etc/ca-certificates.conf /etc/env.d /etc/env.d/java/ /etc/eselect/postgresql /etc/fonts/fonts.conf /etc/gconf /etc/gentoo-release /etc/revdep-rebuild /etc/sandbox.d /etc/splash /etc/terminfo /etc/texmf/language.dat.d /etc/texmf/language.def.d /etc/texmf/updmap.d /etc/texmf/web2c"
CXXFLAGS="-O2 -pipe"
DISTDIR="/var/cache/distfiles"
FEATURES="assume-digests distlocks fixpackages news parallel-fetch protect-owned sandbox sfperms split-log strict test test-fail-continue unmerge-orphans userfetch userpriv usersandbox"
GENTOO_MIRRORS="http://ftp.uni-erlangen.de/pub/mirrors/gentoo"
INSTALL_MASK="  /usr/share/doc  /usr/share/info"
LANG="en_US.utf8"
LDFLAGS="-Wl,-O1"
MAKEOPTS="-j14"
PKGDIR="/var/spool/portage/packages"
PORTAGE_COMPRESS=""
PORTAGE_CONFIGROOT="/"
PORTAGE_RSYNC_OPTS="--recursive --links --safe-links --perms --times --compress --force --whole-file --delete --stats --timeout=180 --exclude=/distfiles --exclude=/local --exclude=/packages"
PORTAGE_TMPDIR="/var/tmp"
PORTDIR="/var/cache/portage/tree-tinderbox"
SYNC="rsync://rsync.gentoo.org/gentoo-portage"
USE="acl berkdb bzip2 cli cracklib crypt cups cxx dri fortran gdbm gpm iconv ipv6 java5 java6 modules mudflap ncurses nls nostatic nptl nptlonly openmp pam pcre perl pppd python qt3support readline reflection ruby session spl ssl sysfs tcpd unicode x86 xorg zlib" ALSA_CARDS="ali5451 als4000 atiixp atiixp-modem bt87x ca0106 cmipci emu10k1 emu10k1x ens1370 ens1371 es1938 es1968 fm801 hda-intel intel8x0 intel8x0m maestro3 trident usb-audio via82xx via82xx-modem ymfpci" ALSA_PCM_PLUGINS="adpcm alaw asym copy dmix dshare dsnoop empty extplug file hooks iec958 ioplug ladspa lfloat linear meter mmap_emul mulaw multi null plug rate route share shm softvol" APACHE2_MODULES="actions alias auth_basic authn_alias authn_anon authn_dbm authn_default authn_file authz_dbm authz_default authz_groupfile authz_host authz_owner authz_user autoindex cache dav dav_fs dav_lock deflate dir disk_cache env expires ext_filter file_cache filter headers include info log_config logio mem_cache mime mime_magic negotiation rewrite setenvif speling status unique_id userdir usertrack vhost_alias auth_digest" ELIBC="glibc" KERNEL="linux" LCD_DEVICES="bayrad cfontz cfontz633 glk hd44780 lb216 lcdm001 mtxorb ncurses text" RUBY_TARGETS="ruby18" USERLAND="GNU"
Unset:  CPPFLAGS, CTARGET, EMERGE_DEFAULT_OPTS, FFLAGS, LC_ALL, LINGUAS, PORTAGE_COMPRESS_FLAGS, PORTAGE_RSYNC_EXTRA_OPTS, PORTDIR_OVERLAY
Comment 1 Diego Elio Pettenò (RETIRED) gentoo-dev 2009-12-22 22:11:37 UTC
Created attachment 213845 [details]
Build log
Comment 2 Diego Elio Pettenò (RETIRED) gentoo-dev 2010-05-21 21:21:49 UTC
I propose restricting these; I just noted that they also are interactive as they ask for root password during test phase if stdin is interactive…
Comment 3 Amadeusz Żołnowski (RETIRED) gentoo-dev 2010-08-25 19:15:36 UTC
(In reply to comment #2)
> I propose restricting these; I just noted that they also are interactive as
> they ask for root password during test phase if stdin is interactive…

Restricting is good idea. First of all tests need root privileges. The interactivity is not a problem, because we can fix that quite easily (but afair user input is not required). Next, there are plans to rewrite Dracut tests suites completely, however there's no sensible way to avoid requirement of root privileges and we cannot grant them in test phase.
Comment 4 Amadeusz Żołnowski (RETIRED) gentoo-dev 2010-08-25 19:19:26 UTC
Created attachment 244605 [details]
dracut-007.ebuild

Fixes issue. Thanks to Diego E. Pettenò for report and proposed solution!
Comment 5 Amadeusz Żołnowski (RETIRED) gentoo-dev 2011-03-21 12:40:22 UTC
Tests are restricted for now, but making them working is planned for the late future.
Comment 6 Nikoli 2011-06-23 05:59:13 UTC
Why RESTRICT="test" was removed from 009 and 010 ebuilds? src_test still fails:

>>> Test phase [check]: sys-kernel/dracut-010-r2
make -C test check
make[1]: Entering directory `/var/tmp/portage/sys-kernel/dracut-010-r2/work/dracut-010/test'
make[2]: Entering directory `/var/tmp/portage/sys-kernel/dracut-010-r2/work/dracut-010/test/TEST-10-RAID'
TEST: root filesystem on an encrypted LVM PV on a RAID-5 [FAILED]
see /var/tmp/portage/sys-kernel/dracut-010-r2/work/dracut-010/test/TEST-10-RAID/test.log
make[2]: *** [all] Error 1
make[2]: Leaving directory `/var/tmp/portage/sys-kernel/dracut-010-r2/work/dracut-010/test/TEST-10-RAID'
make[2]: Entering directory `/var/tmp/portage/sys-kernel/dracut-010-r2/work/dracut-010/test/TEST-11-LVM'
TEST: root filesystem on LVM PV [FAILED]
see /var/tmp/portage/sys-kernel/dracut-010-r2/work/dracut-010/test/TEST-11-LVM/test.log
make[2]: *** [all] Error 1
make[2]: Leaving directory `/var/tmp/portage/sys-kernel/dracut-010-r2/work/dracut-010/test/TEST-11-LVM'
make[2]: Entering directory `/var/tmp/portage/sys-kernel/dracut-010-r2/work/dracut-010/test/TEST-12-RAID-DEG'
TEST: root filesystem on an encrypted LVM PV on a degraded RAID-5 [FAILED]
see /var/tmp/portage/sys-kernel/dracut-010-r2/work/dracut-010/test/TEST-12-RAID-DEG/test.log
make[2]: *** [all] Error 1
make[2]: Leaving directory `/var/tmp/portage/sys-kernel/dracut-010-r2/work/dracut-010/test/TEST-12-RAID-DEG'
make[2]: Entering directory `/var/tmp/portage/sys-kernel/dracut-010-r2/work/dracut-010/test/TEST-13-ENC-RAID-LVM'
TEST: root filesystem on LVM on encrypted partitions of a RAID-5 [FAILED]
see /var/tmp/portage/sys-kernel/dracut-010-r2/work/dracut-010/test/TEST-13-ENC-RAID-LVM/test.log
make[2]: *** [all] Error 1
make[2]: Leaving directory `/var/tmp/portage/sys-kernel/dracut-010-r2/work/dracut-010/test/TEST-13-ENC-RAID-LVM'
make[2]: Entering directory `/var/tmp/portage/sys-kernel/dracut-010-r2/work/dracut-010/test/TEST-14-IMSM'
TEST: root filesystem on LVM PV on a isw dmraid [FAILED]
see /var/tmp/portage/sys-kernel/dracut-010-r2/work/dracut-010/test/TEST-14-IMSM/test.log
make[2]: *** [all] Error 1
make[2]: Leaving directory `/var/tmp/portage/sys-kernel/dracut-010-r2/work/dracut-010/test/TEST-14-IMSM'
make[2]: Entering directory `/var/tmp/portage/sys-kernel/dracut-010-r2/work/dracut-010/test/TEST-20-NFS'
TEST: root filesystem on NFS [FAILED]
see /var/tmp/portage/sys-kernel/dracut-010-r2/work/dracut-010/test/TEST-20-NFS/test.log
make[2]: *** [all] Error 1
make[2]: Leaving directory `/var/tmp/portage/sys-kernel/dracut-010-r2/work/dracut-010/test/TEST-20-NFS'
make[2]: Entering directory `/var/tmp/portage/sys-kernel/dracut-010-r2/work/dracut-010/test/TEST-30-ISCSI'
TEST: root filesystem over iSCSI [FAILED]
see /var/tmp/portage/sys-kernel/dracut-010-r2/work/dracut-010/test/TEST-30-ISCSI/test.log
make[2]: *** [all] Error 1
make[2]: Leaving directory `/var/tmp/portage/sys-kernel/dracut-010-r2/work/dracut-010/test/TEST-30-ISCSI'
make[2]: Entering directory `/var/tmp/portage/sys-kernel/dracut-010-r2/work/dracut-010/test/TEST-40-NBD'
TEST: root filesystem on NBD [FAILED]
see /var/tmp/portage/sys-kernel/dracut-010-r2/work/dracut-010/test/TEST-40-NBD/test.log
make[2]: *** [all] Error 1
make[2]: Leaving directory `/var/tmp/portage/sys-kernel/dracut-010-r2/work/dracut-010/test/TEST-40-NBD'
make[2]: Entering directory `/var/tmp/portage/sys-kernel/dracut-010-r2/work/dracut-010/test/TEST-50-MULTINIC'
TEST: root filesystem on NFS with multiple nics [FAILED]
see /var/tmp/portage/sys-kernel/dracut-010-r2/work/dracut-010/test/TEST-50-MULTINIC/test.log
make[2]: *** [all] Error 1
make[2]: Leaving directory `/var/tmp/portage/sys-kernel/dracut-010-r2/work/dracut-010/test/TEST-50-MULTINIC'
make[1]: *** [check] Error 2
make[1]: Leaving directory `/var/tmp/portage/sys-kernel/dracut-010-r2/work/dracut-010/test'
make: *** [check] Error 2
Comment 7 Amadeusz Żołnowski (RETIRED) gentoo-dev 2011-06-23 11:19:23 UTC
(In reply to comment #6)
> Why RESTRICT="test" was removed from 009 and 010 ebuilds?

Oversight.  Thanks!  All dracut ebuilds have RESTRICT="test" now.