Gentoo Websites Logo
Go to: Gentoo Home Documentation Forums Lists Bugs Planet Store Wiki Get Gentoo!
Bug 277645 - Stabilization of dev-lang/python-2.6.2-r1 and dev-python/python-docs-2.6.2-r1
Summary: Stabilization of dev-lang/python-2.6.2-r1 and dev-python/python-docs-2.6.2-r1
Alias: None
Product: Gentoo Linux
Classification: Unclassified
Component: [OLD] Development (show other bugs)
Hardware: All Linux
: High enhancement (vote)
Assignee: Python Gentoo Team
Depends on: 275997 277333 277347 277350 277351 277353 277354 277822 277843 277862 277947 278285 279073 279391 280376 280378 280379 282786 283286
Blocks: 285115
  Show dependency tree
Reported: 2009-07-13 12:04 UTC by Arfrever Frehtes Taifersar Arahesis (RETIRED)
Modified: 2009-10-19 16:02 UTC (History)
4 users (show)

See Also:
Package list:
Runtime testing required: ---

build log (build.log,39.70 KB, text/plain)
2009-08-16 17:16 UTC, Carlos Konstanski
environment (environment,157.81 KB, text/plain)
2009-08-16 17:16 UTC, Carlos Konstanski
emerge --info (,4.33 KB, text/plain)
2009-08-16 17:17 UTC, Carlos Konstanski

Note You need to log in before you can comment on or make changes to this bug.
Description Arfrever Frehtes Taifersar Arahesis (RETIRED) gentoo-dev 2009-07-13 12:04:58 UTC
Please stabilize dev-lang/python-2.6.2-r1.

Remember to run `python-updater` after switching Python version.
It is recommended to use app-admin/python-updater-0.7.
Don't report here any problems occuring during running `python-updater`.

Members of architecture projects:
  If you reproduce a (not already reported) bug in dev-lang/python-2.6.2-r1,
  please open a new bug and, in this bug, write information about another bug.

Non-members of architecture projects (e.g. normal users):
  Don't report any problems with dev-lang/python or any Python packages or
  anything else in this bug.
Comment 1 Christian Faulhammer (RETIRED) gentoo-dev 2009-07-14 07:43:47 UTC
I get a test failure like that:

FAIL: test_bad_address (test.test_urllib2_localnet.TestUrlopen)
Traceback (most recent call last):
  File "/var/tmp/portage/dev-lang/python-2.6.2-r1/work/Python-2.6.2/Lib/test/", line 477, in test_bad_address
    urllib2.urlopen, "http://sadflkjsasf.i.nvali.d/")
AssertionError: IOError not raised

Ran 9 tests in 8.130s

FAILED (failures=1)
test test_urllib2_localnet failed -- Traceback (most recent call last):
  File "/var/tmp/portage/dev-lang/python-2.6.2-r1/work/Python-2.6.2/Lib/test/", line 477, in test_bad_address
    urllib2.urlopen, "http://sadflkjsasf.i.nvali.d/")
AssertionError: IOError not raised

make: *** [test] Error 1
Portage (default/linux/x86/2008.0/desktop, gcc-4.3.2, glibc-2.9_p20081201-r2, 2.6.29-gentoo-r5 i686)
System uname: Linux-2.6.29-gentoo-r5-i686-Intel-R-_Core-TM-2_Duo_CPU_T8100_@_2.10GHz-with-glibc2.0
Timestamp of tree: Tue, 14 Jul 2009 06:00:02 +0000
app-shells/bash:     3.2_p39
dev-java/java-config: 2.1.8-r1
dev-lang/python:     2.4.6, 2.5.4-r3
dev-python/pycrypto: 2.0.1-r8
dev-util/cmake:      2.6.4
sys-apps/sandbox:    1.6-r2
sys-devel/autoconf:  2.13, 2.63
sys-devel/automake:  1.4_p6, 1.5, 1.6.3, 1.7.9-r1, 1.8.5-r3, 1.9.6-r2, 1.10.2
sys-devel/binutils:  2.18-r3
sys-devel/gcc-config: 1.4.1
sys-devel/libtool:   1.5.26
virtual/os-headers:  2.6.27-r2
CFLAGS="-O2 -march=i686 -pipe"
CONFIG_PROTECT="/etc /opt/openfire/resources/security/ /opt/openjms/config /usr/kde/3.5/env /usr/kde/3.5/share/config /usr/kde/3.5/shutdown /usr/lib/fax /usr/share/config /var/lib/hsqldb /var/qmail/alias /var/qmail/control /var/spool/fax/etc"
CONFIG_PROTECT_MASK="/etc/ca-certificates.conf /etc/env.d /etc/env.d/java/ /etc/fonts/fonts.conf /etc/gconf /etc/php/apache2-php5/ext-active/ /etc/php/cgi-php5/ext-active/ /etc/php/cli-php5/ext-active/ /etc/revdep-rebuild /etc/sandbox.d /etc/terminfo /etc/texmf/language.dat.d /etc/texmf/language.def.d /etc/texmf/updmap.d /etc/texmf/web2c /etc/udev/rules.d"
CXXFLAGS="-O2 -march=i686 -pipe"
FEATURES="distlocks fixpackages parallel-fetch protect-owned sandbox sfperms strict unmerge-orphans userfetch userpriv"
PORTAGE_RSYNC_OPTS="--recursive --links --safe-links --perms --times --compress --force --whole-file --delete --stats --timeout=180 --exclude=/distfiles --exclude=/local --exclude=/packages"
USE="3dnow 3dnowext X acl acpi alsa apache apache2 apm bash-completion berkdb bluetooth bootsplash branding bzip2 cairo cdr cdrom cli cracklib crypt css cups curl dbus directfb dri dvd dvdr dvdread dvi eds emacs emboss encode escreen esd evo fam fat fbcon fbcondecor ffmpeg firefox foomatic fortran gdbm gif gnome gpm gstreamer gtk hal iconv imlib ipv6 isdnlog jadetex java5 jpeg jpeg2k kde kpathsea laptop latex ldap libnotify libotf lm_sensors m17n-lib mad midi mikmod mmx mono mp3 mpeg mudflap musicbrainz ncurses nls nptl nptl-only nptlonly ntfs objc ogg opengl openmp openssh pam pcre pdf perl pmu png ppds pppd preview-latex python qt3 qt3support qt4 quicktime readline reflection reports sdl session smp spell spl sqlite sse ssl startup-notification svg svga sysfs t1lib tcpd test-framework tetex theora tiff tk toolkit-scroll-bars truetype unicode usb userlocales video vorbis win32codecs wmf x86 xft xml xorg xpm xulrunner xv xvid zlib" ALSA_CARDS="ali5451 als4000 atiixp atiixp-modem bt87x ca0106 cmipci emu10k1 emu10k1x ens1370 ens1371 es1938 es1968 fm801 hda-intel intel8x0 intel8x0m maestro3 trident usb-audio via82xx via82xx-modem ymfpci" ALSA_PCM_PLUGINS="adpcm alaw asym copy dmix dshare dsnoop empty extplug file hooks iec958 ioplug ladspa lfloat linear meter mmap_emul mulaw multi null plug rate route share shm softvol" APACHE2_MODULES="actions alias auth_basic authn_alias authn_anon authn_dbm authn_default authn_file authz_dbm authz_default authz_groupfile authz_host authz_owner authz_user autoindex cache dav dav_fs dav_lock deflate dir disk_cache env expires ext_filter file_cache filter headers include info log_config logio mem_cache mime mime_magic negotiation rewrite setenvif speling status unique_id userdir usertrack vhost_alias" ELIBC="glibc" INPUT_DEVICES="synaptics mouse keyboard" KERNEL="linux" LCD_DEVICES="bayrad cfontz cfontz633 glk hd44780 lb216 lcdm001 mtxorb ncurses text" LINGUAS="en" LIRC_DEVICES="atiusb" USERLAND="GNU" VIDEO_CARDS="vesa fbdev intel"

Further testing is to be done, so don't worry.
Comment 2 Jeremy Olexa (darkside) (RETIRED) archtester gentoo-dev Security 2009-07-16 03:06:20 UTC
(All non-skipped tests passed for amd64; just need to get through the depending bugs)
Comment 3 Christian Faulhammer (RETIRED) gentoo-dev 2009-07-21 21:27:22 UTC
Apart from the bugs already listed as blockers, there are some more show-stoppers.  Arfrever and I will sort it out and will give green light, maybe you will find more obstacles.
Comment 4 Brent Baude (RETIRED) gentoo-dev 2009-07-26 22:31:55 UTC
ppc64 stable
Comment 5 Arfrever Frehtes Taifersar Arahesis (RETIRED) gentoo-dev 2009-07-26 23:01:24 UTC
(In reply to comment #4)
> ppc64 stable

You haven't committed it.
Comment 6 Arfrever Frehtes Taifersar Arahesis (RETIRED) gentoo-dev 2009-07-30 23:26:47 UTC
dev-python/python-docs-2.6.2-r1 also should be stabilized.
Comment 7 Jeremy Olexa (darkside) (RETIRED) archtester gentoo-dev Security 2009-07-30 23:28:12 UTC
amd64 stable

-all depending bugs done for amd64
-ran in my stable chroot for over 2 weeks
-stabilized depending bugs with py-2.6
-marked dev-python/python-docs-2.6.2-r1 stable
Comment 8 Christian Faulhammer (RETIRED) gentoo-dev 2009-07-31 09:13:19 UTC
There are still some packages out there that need fixing (see the 2.6 tracker) and I have some bugs to file, when I find time.
Comment 9 Christian Faulhammer (RETIRED) gentoo-dev 2009-08-14 06:49:47 UTC
(In reply to comment #8)
> There are still some packages out there that need fixing (see the 2.6 tracker)
> and I have some bugs to file, when I find time.

 I am through with my stuff, and the bug 230205 tracker contains only minor issues in my eyes.  Python team, are you ok with stabling 2.6?
Comment 10 Arfrever Frehtes Taifersar Arahesis (RETIRED) gentoo-dev 2009-08-14 15:05:44 UTC
(In reply to comment #9)
> Python team, are you ok with stabling 2.6?

Comment 11 Christian Faulhammer (RETIRED) gentoo-dev 2009-08-16 08:22:24 UTC
x86 stable
Comment 12 Carlos Konstanski 2009-08-16 17:13:56 UTC
compile fails on x86:

[ebuild  NS   ] dev-lang/python-2.6.2-r1 [2.5.4-r3] USE="berkdb gdbm ipv6 ncurses readline ssl threads tk xml -build -doc -examples -sqlite -ucs2 -wininst" 0 kB


Parser/pgen ./Grammar/Grammar ./Include/graminit.h ./Python/graminit.c
Parser/pgen ./Grammar/Grammar ./Include/graminit.h ./Python/graminit.c
i686-pc-linux-gnu-gcc -pthread -c -fno-strict-aliasing -DNDEBUG -O2 -march=pentium4  -I. -IInclude -I./Include  -fPIC -DPy_BUILD_CORE -o Python/graminit.o Python/graminit.c
Python/graminit.c:1161: error: ‘arcs_’ undeclared here (not in a function)
Python/graminit.c:1161: error: expected ‘}’ at end of input
Comment 13 Carlos Konstanski 2009-08-16 17:16:02 UTC
Created attachment 201437 [details]
build log
Comment 14 Carlos Konstanski 2009-08-16 17:16:26 UTC
Created attachment 201438 [details]
Comment 15 Carlos Konstanski 2009-08-16 17:17:20 UTC
Created attachment 201440 [details]
emerge --info
Comment 16 Carlos Konstanski 2009-08-16 17:32:13 UTC
Compile succeeded with MAKEOPTS="-j1".  There must have been a compile-time race condition, where some dependent file wasn't compiled in time.  It should show up in my attachments.
Comment 17 Arfrever Frehtes Taifersar Arahesis (RETIRED) gentoo-dev 2009-08-16 18:14:36 UTC
(In reply to comment #12)

Please read the last paragraph of comment #0.
Comment 18 Tobias Klausmann (RETIRED) gentoo-dev 2009-08-26 09:44:20 UTC
Added bug 282786 for alpha. Probably related to bug 264335 (floor/ceil/rint on alpha glibc is broken. There's a patch for glibc, but it hasn't been applied yet)
Comment 19 Tobias Klausmann (RETIRED) gentoo-dev 2009-08-26 15:22:08 UTC
Both stable on alpha.
Comment 20 Raúl Porcel (RETIRED) gentoo-dev 2009-08-28 19:02:14 UTC
arm/m68k stable
Comment 21 Raúl Porcel (RETIRED) gentoo-dev 2009-09-05 17:20:44 UTC
ia64/sparc stable
Comment 22 Jeroen Roovers (RETIRED) gentoo-dev 2009-09-17 18:15:05 UTC
Stable for HPPA. dev-python/gdata-2* can wait as only media-video/totem depends on it and that package has issues of its own for HPPA.
Comment 23 Nikhil Sethi 2009-09-18 21:20:15 UTC
Please see
2.6.2-r1 fails for me on x86 with ValueError: cannot convert float NaN to integer
The above bug has details.
Comment 24 Tom Gall (RETIRED) gentoo-dev 2009-09-22 04:41:45 UTC
stable on ppc64
Comment 25 nixnut (RETIRED) gentoo-dev 2009-09-27 14:30:16 UTC
ppc stable
Comment 26 Raúl Porcel (RETIRED) gentoo-dev 2009-10-19 16:02:12 UTC
s390/sh stable, closing