Gentoo Websites Logo
Go to: Gentoo Home Documentation Forums Lists Bugs Planet Store Wiki Get Gentoo!
Bug 269247 - dev-python/PyAmanith-0.3.34 fails to merge with GCC 4.4
Summary: dev-python/PyAmanith-0.3.34 fails to merge with GCC 4.4
Status: RESOLVED DUPLICATE of bug 269245
Alias: None
Product: Gentoo Linux
Classification: Unclassified
Component: [OLD] GCC Porting (show other bugs)
Hardware: All Linux
: High normal (vote)
Assignee: Python Gentoo Team
Depends on:
Reported: 2009-05-10 13:26 UTC by 404 Error
Modified: 2009-07-20 10:52 UTC (History)
3 users (show)

See Also:
Package list:
Runtime testing required: ---

build.log (build.log,2.61 KB, text/plain)
2009-05-10 13:27 UTC, 404 Error

Note You need to log in before you can comment on or make changes to this bug.
Description 404 Error 2009-05-10 13:26:33 UTC
When emerged, the package compilation fails :
/usr/include/amanith/2d/gpolylinecurve2d.h:78: Warning(362): operator= ignored
typemaps.i:96: Warning(453): Can't apply (Amanith::GPixelMap &INOUT). No typemaps are defined.
creating build/temp.linux-x86_64-2.6
x86_64-pc-linux-gnu-gcc -pthread -DNDEBUG -march=native -O2 -pipe -msse4 -fPIC -I/usr/include/python2.6 -c amanith_wrap.cpp -o build/temp.linux-x86_64-2.6/amanith_wrap.o -Ichanges/include -Iinclude -I/usr/include
In file included from include/pyamanith.h:29,
                 from amanith_wrap.cpp:3016:
/usr/include/amanith/2d/gtesselator2d.h:167: error: 'std::FILE' has not been declared
/usr/include/amanith/2d/gtesselator2d.h:168: error: 'std::FILE' has not been declared
error: command 'x86_64-pc-linux-gnu-gcc' failed with exit status 1
 * ERROR: dev-python/PyAmanith-0.3.34 failed.
 * Call stack:
 *     , line   49:  Called src_compile
 *             environment, line 2537:  Called distutils_src_compile
 *             environment, line  728:  Called die
 * The specific snippet of code:
 *       ${python} build "$@" || die "compilation failed"
 *  The die message:
 *   compilation failed
 * If you need support, post the topmost build error, and the call stack if relevant.
 * A complete build log is located at '/var/tmp/portage/dev-python/PyAmanith-0.3.34/temp/build.log'.

Reproducible: Always

Portage (default/linux/amd64/2008.0/desktop, gcc-4.4.0, glibc-2.9_p20081201-r2, 2.6.30-rc5 x86_64)
System uname: Linux-2.6.30-rc5-x86_64-Intel-R-_Core-TM-_i7_CPU_920_@_2.67GHz-with-gentoo-2.0.0
Timestamp of tree: Sat, 09 May 2009 21:45:01 +0000
distcc 3.1 x86_64-pc-linux-gnu [disabled]
ccache version 2.4 [disabled]
app-shells/bash:     4.0_p17-r1
dev-java/java-config: 2.1.7
dev-lang/python:     2.5.4-r2, 2.6.2
dev-python/pycrypto: 2.0.1-r8
dev-util/ccache:     2.4-r8
dev-util/cmake:      2.6.4
sys-apps/baselayout: 2.0.0
sys-apps/openrc:     0.4.3-r2
sys-apps/sandbox:    1.9
sys-devel/autoconf:  2.13, 2.63-r1
sys-devel/automake:  1.5, 1.7.9-r1, 1.8.5-r3, 1.9.6-r2, 1.10.2
sys-devel/binutils:  2.19.1-r1
sys-devel/gcc-config: 1.4.1
sys-devel/libtool:   2.2.6a
virtual/os-headers:  2.6.28-r1
ACCEPT_KEYWORDS="amd64 ~amd64"
CFLAGS="-march=native -O2 -pipe -msse4"
CONFIG_PROTECT="/etc /usr/kde/3.5/env /usr/kde/3.5/share/config /usr/kde/3.5/shutdown /usr/share/config /var/bind"
CONFIG_PROTECT_MASK="/etc/ca-certificates.conf /etc/env.d /etc/env.d/java/ /etc/eselect/postgresql /etc/fonts/fonts.conf /etc/gconf /etc/gentoo-release /etc/revdep-rebuild /etc/sandbox.d /etc/terminfo /etc/texmf/language.dat.d /etc/texmf/language.def.d /etc/texmf/updmap.d /etc/texmf/web2c /etc/udev/rules.d"
CXXFLAGS="-march=native -O2 -pipe -msse4"
FEATURES="distlocks fixpackages metadata-transfer parallel-fetch protect-owned sandbox sfperms strict unmerge-orphans userfetch"
LINGUAS="en fr"
PORTAGE_RSYNC_OPTS="--recursive --links --safe-links --perms --times --compress --force --whole-file --delete --stats --timeout=180 --exclude=/distfiles --exclude=/local --exclude=/packages"
PORTDIR_OVERLAY="/usr/local/portage/layman/nx /usr/local/portage/layman/enlightenment /usr/local/portage/layman/mozilla /usr/local/portage/layman/dotnet /usr/local/portage/layman/emacs /usr/local/portage/layman/gentoo-quebec"
USE="X a52 aac acl acpi alsa amd64 apache2 berkdb bluetooth branding bzip2 cairo cdda cddb cdio cdr chardet cli cracklib crypt cups dbus dirac dri dts dvd dvdr dvdread dvi eds emboss encode esd evo fam ffmpeg flac fortran ftp gdbm gif glib gnome gpm gstreamer gtk gtk2 hal hvm iconv isdnlog jack java jpeg jpeg2k kde kdeprefix kerberos kpathsea ldap libnotify mad midi mikmod mmx mp2 mp3 mpeg mudflap multilib nautilus ncurses nls nptl nptlonly nswrapper objc objc++ objc-gc ogg openal opengl openmp oss pam pcre pdf perl png postgres ppds pppd python qt3 qt3support qt4 quicktime readline reflection samba sdl session spell spl sse sse2 sse3 ssl ssse3 startup-notification svg sysfs tcl tcpd theora threads tiff tk truetype unicode usb vorbis x264 xml xorg xulrunner xv xvid zlib" ALSA_CARDS="ali5451 als4000 atiixp atiixp-modem bt87x ca0106 cmipci emu10k1x ens1370 ens1371 es1938 es1968 fm801 hda-intel intel8x0 intel8x0m maestro3 trident usb-audio via82xx via82xx-modem ymfpci" ALSA_PCM_PLUGINS="adpcm alaw asym copy dmix dshare dsnoop empty extplug file hooks iec958 ioplug ladspa lfloat linear meter mmap_emul mulaw multi null plug rate route share shm softvol" APACHE2_MODULES="actions alias auth_basic authn_alias authn_anon authn_dbm authn_default authn_file authz_dbm authz_default authz_groupfile authz_host authz_owner authz_user autoindex cache dav dav_fs dav_lock deflate dir disk_cache env expires ext_filter file_cache filter headers include info log_config logio mem_cache mime mime_magic negotiation rewrite setenvif speling status unique_id userdir usertrack vhost_alias" ELIBC="glibc" INPUT_DEVICES="evdev" KERNEL="linux" LCD_DEVICES="bayrad cfontz cfontz633 glk hd44780 lb216 lcdm001 mtxorb ncurses text" LINGUAS="en fr" USERLAND="GNU" VIDEO_CARDS="vesa radeonhd"
Comment 1 404 Error 2009-05-10 13:27:25 UTC
Created attachment 190838 [details]
Comment 2 Víctor Ostorga (RETIRED) gentoo-dev 2009-05-23 21:17:09 UTC
Can you try to reproduce this with patch provided in bug 269245 ?
Comment 3 404 Error 2009-07-19 19:09:42 UTC

In file included from include/pyamanith.h:29,
                 from amanith_wrap.cpp:3016:
/usr/include/amanith/2d/gtesselator2d.h:167: error: ‘std::FILE’ has not been declared
/usr/include/amanith/2d/gtesselator2d.h:168: error: ‘std::FILE’ has not been declared
error: command 'x86_64-pc-linux-gnu-gcc' failed with exit status 1

Comment 4 Arfrever Frehtes Taifersar Arahesis (RETIRED) gentoo-dev 2009-07-20 00:12:34 UTC
(In reply to comment #3)

You forgot to rebuild media-libs/amanith.

*** This bug has been marked as a duplicate of bug 269245 ***
Comment 5 404 Error 2009-07-20 10:52:56 UTC
Re-emerged the libray, problem does not appear.