Gentoo Websites Logo
Go to: Gentoo Home Documentation Forums Lists Bugs Planet Store Wiki Get Gentoo!
Bug 213957 - [PATCH] net-analyzer/tcptrack-1.2.0 fails to compile with gcc-4.3
Summary: [PATCH] net-analyzer/tcptrack-1.2.0 fails to compile with gcc-4.3
Status: RESOLVED FIXED
Alias: None
Product: Gentoo Linux
Classification: Unclassified
Component: [OLD] GCC Porting (show other bugs)
Hardware: All Linux
: High normal (vote)
Assignee: Netmon Herd
URL:
Whiteboard:
Keywords:
Depends on:
Blocks: gcc-4.3
  Show dependency tree
 
Reported: 2008-03-19 21:14 UTC by Michał Kiedrowicz
Modified: 2008-03-31 18:01 UTC (History)
0 users

See Also:
Package list:
Runtime testing required: ---


Attachments
tcptrack-1.2.0-string.h.patch (tcptrack-1.2.0-string.h.patch,356 bytes, patch)
2008-03-19 21:15 UTC, Michał Kiedrowicz
Details | Diff

Note You need to log in before you can comment on or make changes to this bug.
Description Michał Kiedrowicz 2008-03-19 21:14:38 UTC
x86_64-pc-linux-gnu-g++ -DHAVE_CONFIG_H -I. -I. -I..     -march=core2 -O2 -pipe -ggdb -c -o util.o util.cc
util.cc: In function ‘nlp* getnlp(const u_char*, int, const pcap_pkthdr*)’:
util.cc:79: error: ‘memcpy’ was not declared in this scope
util.cc:93: error: ‘memcpy’ was not declared in this scope
util.cc:103: error: ‘memcpy’ was not declared in this scope
make[2]: *** [util.o] Error 1
make[2]: *** Waiting for unfinished jobs....
make[2]: Leaving directory `/var/tmp/portage/net-analyzer/tcptrack-1.2.0/work/tcptrack-1.2.0/src'
make[1]: *** [all-recursive] Error 1
make[1]: Leaving directory `/var/tmp/portage/net-analyzer/tcptrack-1.2.0/work/tcptrack-1.2.0'
make: *** [all] Error 2


Reproducible: Always
Comment 1 Michał Kiedrowicz 2008-03-19 21:15:23 UTC
Created attachment 146611 [details, diff]
tcptrack-1.2.0-string.h.patch
Comment 2 Cédric Krier gentoo-dev 2008-03-31 17:55:43 UTC
Add in version 1.3.0 in cvs
Comment 3 Cédric Krier gentoo-dev 2008-03-31 18:01:08 UTC
Patch also added to 1.2.0