Gentoo Websites Logo
Go to: Gentoo Home Documentation Forums Lists Bugs Planet Store Wiki Get Gentoo!
Bug 198145 - x11-wm/emerald-0.2.1 failed
Summary: x11-wm/emerald-0.2.1 failed
Status: RESOLVED DUPLICATE of bug 189374
Alias: None
Product: Gentoo Linux
Classification: Unclassified
Component: Current packages (show other bugs)
Hardware: AMD64 Linux
: High normal (vote)
Assignee: Gentoo Linux bug wranglers
Depends on:
Reported: 2007-11-05 09:26 UTC by Michal Jakubowski
Modified: 2007-11-05 09:28 UTC (History)
0 users

See Also:
Package list:
Runtime testing required: ---

build.log (build.log,10.51 KB, text/plain)
2007-11-05 09:27 UTC, Michal Jakubowski

Note You need to log in before you can comment on or make changes to this bug.
Description Michal Jakubowski 2007-11-05 09:26:49 UTC
Making all in libengine
Making all in src
main.c: In function 'action_menu_map':
main.c:3784: error: 'WNCK_WINDOW_MODAL_DIALOG' undeclared (first use in this function)
main.c:3784: error: (Each undeclared identifier is reported only once
main.c:3784: error: for each function it appears in.)
make[2]: *** [main.o] Error 1
make[1]: *** [all-recursive] Error 1
make: *** [all] Error 2
 * ERROR: x11-wm/emerald-0.2.1 failed.
 * Call stack:
 *, line 1696:  Called dyn_compile
 *, line 1034:  Called qa_call 'src_compile'
 *, line   44:  Called src_compile
 *, line 1378:  Called gnome2_src_compile
 *   gnome2.eclass, line   71:  Called die
 * The specific snippet of code:
 *      emake || die "compile failure"
 *  The die message:
 *   compile failure
 * If you need support, post the topmost build error, and the call stack if relevant.
 * A complete build log is located at '/var/tmp/portage/x11-wm/emerald-0.2.1/temp/build.log

Reproducible: Always
Comment 1 Michal Jakubowski 2007-11-05 09:27:19 UTC
Created attachment 135236 [details]
Comment 2 Jakub Moc (RETIRED) gentoo-dev 2007-11-05 09:28:18 UTC

*** This bug has been marked as a duplicate of bug 189374 ***