Gentoo Websites Logo
Go to: Gentoo Home Documentation Forums Lists Bugs Planet Store Wiki Get Gentoo!
Bug 169655 - gnome-extra/evolution-exchange-2.8.3 fails with --as-needed
Summary: gnome-extra/evolution-exchange-2.8.3 fails with --as-needed
Status: RESOLVED DUPLICATE of bug 133458
Alias: None
Product: Gentoo Linux
Classification: Unclassified
Component: New packages (show other bugs)
Hardware: All Linux
: High normal (vote)
Assignee: Gentoo Linux bug wranglers
Depends on:
Reported: 2007-03-06 19:59 UTC by Patrizio Bassi
Modified: 2007-03-06 20:11 UTC (History)
0 users

See Also:
Package list:
Runtime testing required: ---


Note You need to log in before you can comment on or make changes to this bug.
Description Patrizio Bassi 2007-03-06 19:59:31 UTC
-Wpointer-arith -Wno-sign-compare -Wno-sign-compare -Wl,-O1 -Wl,--sort-common -Wl,--enable-new-dtags -Wl,--as-needed -Wl,--hash-style=both -o migr-test migr-test.o exchange-config-listener.o exchange-migrate.o -Wl,-R/usr/lib64/evolution/2.8 -pthread -Wl,--export-dynamic -Wl,-R/usr/lib64/evolution/2.8 -pthread  -L/usr/lib64 -L/usr/lib64/evolution/2.8 -L/usr/lib64/nspr -L/usr/lib64/lib -L/usr/lib64/nss /usr/lib64/ /usr/lib64/ /usr/lib64/ /usr/lib64/evolution/2.8/ /usr/lib64/evolution/2.8/ /usr/lib64/evolution/2.8/ /usr/lib64/evolution/2.8/ /usr/lib64/evolution/2.8/ /usr/lib64/evolution/2.8/ /usr/lib64/evolution/2.8/ /usr/lib64/ /usr/lib64/ /usr/lib64/ /usr/lib64/ /usr/lib64/ /usr/lib64/ /usr/lib64/ /usr/lib64/ /usr/lib64/ /usr/lib64/ /usr/lib64/ /usr/lib64/ /usr/lib64/ /usr/lib64/ /usr/lib64/ /usr/lib64/ /usr/lib64/ -lssl3 -lsmime3 -lnss3 -lsoftokn3 /usr/lib64/ -L/usr/lib -lkrb5 -lk5crypto -lcom_err -lgssapi_krb5 /usr/lib64/ -ldb -lplc4 -lplds4 -lnspr4 /usr/lib64/ /usr/lib64/ /usr/lib64/ /usr/lib64/ /usr/lib64/ /usr/lib64/ /usr/lib64/ /usr/lib64/ /usr/lib64/ /usr/lib64/ /usr/lib64/ /usr/lib64/ /usr/lib64/ /usr/lib64/ /usr/lib64/ /usr/lib64/ /usr/lib64/ /usr/lib64/ /usr/lib64/ /usr/lib64/ /usr/lib64/ /usr/lib64/ /usr/lib64/ /usr/lib64/ -lutil /usr/lib64/ /usr/lib64/ -lresolv -lssl -lcrypto /usr/lib64/ /usr/lib64/ /usr/lib64/ /usr/lib64/ -lnsl /usr/lib64/ /usr/lib64/ /usr/lib64/ /usr/lib64/ /usr/lib64/ -lz /usr/lib64/ /usr/lib64/ /usr/lib64/ -lm /usr/lib64/ -ldl /usr/lib64/ -lpthread -lrt /usr/lib64/ -Wl,--rpath -Wl,/usr/lib64/evolution/2.8 -Wl,--rpath -Wl,/usr/lib64/evolution/2.8
/usr/lib64/ undefined reference to `e_passwords_remember_password'
/usr/lib64/ undefined reference to `e_passwords_get_password'
/usr/lib64/ undefined reference to `e_passwords_forget_password'
/usr/lib64/ undefined reference to `e_passwords_add_password'
/usr/lib64/ undefined reference to `e_passwords_ask_password'
collect2: ld returned 1 exit status
make[2]: *** [migr-test] Error 1
make[2]: Leaving directory `/mnt/Dati/Gentoo/tmp/portage/gnome-extra/evolution-exchange-2.8.3/work/evolution-exchange-2.8.3/storage'
make[1]: *** [all-recursive] Error 1
make[1]: Leaving directory `/mnt/Dati/Gentoo/tmp/portage/gnome-extra/evolution-exchange-2.8.3/work/evolution-exchange-2.8.3'
make: *** [all] Error 2

!!! ERROR: gnome-extra/evolution-exchange-2.8.3 failed.
Comment 1 Jakub Moc (RETIRED) gentoo-dev 2007-03-06 20:11:03 UTC

*** This bug has been marked as a duplicate of bug 133458 ***