Gentoo Websites Logo
Go to: Gentoo Home Documentation Forums Lists Bugs Planet Store Wiki Get Gentoo!
Bug 147702 - libdv-0.102 fails to build with gcc 4.1.1
Summary: libdv-0.102 fails to build with gcc 4.1.1
Status: RESOLVED DUPLICATE of bug 118073
Alias: None
Product: Gentoo Linux
Classification: Unclassified
Component: Current packages (show other bugs)
Hardware: x86 Linux
: High major (vote)
Assignee: Gentoo Linux bug wranglers
Depends on:
Reported: 2006-09-15 08:45 UTC by Alexander Puchmayr
Modified: 2006-09-15 09:29 UTC (History)
0 users

See Also:
Package list:
Runtime testing required: ---


Note You need to log in before you can comment on or make changes to this bug.
Description Alexander Puchmayr 2006-09-15 08:45:38 UTC
zeus / # gcc-config -l
 [1] i686-pc-linux-gnu-3.3.6
 [6] i686-pc-linux-gnu-3.4.6
 [11] i686-pc-linux-gnu-4.1.1 *
zeus / #  gcc-config 11
zeus / # . /etc/profile
zeus / # emerge -v --oneshot libdv
alculating dependencies... done!

>>> Emerging (1 of 1) media-libs/libdv-0.102 to /
 * libdv-0.102.tar.gz RMD160 ;-) ...
if /bin/sh ../libtool --silent --mode=compile i686-pc-linux-gnu-gcc -DHAVE_CONFIG_H -I. -I. -I..     -g -O2 -Wall -MT YUY2.lo -MD -MP -MF ".deps/YUY2.Tpo" \
  -c -o YUY2.lo `test -f 'YUY2.c' || echo './'`YUY2.c; \
then mv -f ".deps/YUY2.Tpo" ".deps/YUY2.Plo"; \
else rm -f ".deps/YUY2.Tpo"; exit 1; \
/var/tmp/portage/libdv-0.102/temp/ccAvhpSo.s: Assembler messages:
/var/tmp/portage/libdv-0.102/temp/ccAvhpSo.s:1464: Error: suffix or operands invalid for `paddb'
/var/tmp/portage/libdv-0.102/temp/ccAvhpSo.s:1479: Error: suffix or operands invalid for `paddb'
/var/tmp/portage/libdv-0.102/temp/ccAvhpSo.s:1509: Error: suffix or operands invalid for `paddb'
/var/tmp/portage/libdv-0.102/temp/ccAvhpSo.s:1524: Error: suffix or operands invalid for `paddb'
/var/tmp/portage/libdv-0.102/temp/ccAvhpSo.s:1794: Error: suffix or operands invalid for `paddb'
/var/tmp/portage/libdv-0.102/temp/ccAvhpSo.s:1817: Error: suffix or operands invalid for `paddb'
/var/tmp/portage/libdv-0.102/temp/ccAvhpSo.s:1844: Error: suffix or operands invalid for `paddb'
/var/tmp/portage/libdv-0.102/temp/ccAvhpSo.s:1867: Error: suffix or operands invalid for `paddb'
/var/tmp/portage/libdv-0.102/temp/ccAvhpSo.s:2373: Error: suffix or operands invalid for `paddb'
/var/tmp/portage/libdv-0.102/temp/ccAvhpSo.s:2388: Error: suffix or operands invalid for `paddb'
/var/tmp/portage/libdv-0.102/temp/ccAvhpSo.s:2418: Error: suffix or operands invalid for `paddb'
/var/tmp/portage/libdv-0.102/temp/ccAvhpSo.s:2433: Error: suffix or operands invalid for `paddb'
make[3]: *** [YUY2.lo] Error 1
make[3]: Leaving directory `/var/tmp/portage/libdv-0.102/work/libdv-0.102/libdv'
make[2]: *** [all] Error 2
make[2]: Leaving directory `/var/tmp/portage/libdv-0.102/work/libdv-0.102/libdv'
make[1]: *** [all-recursive] Error 1
make[1]: Leaving directory `/var/tmp/portage/libdv-0.102/work/libdv-0.102'
make: *** [all] Error 2

!!! ERROR: media-libs/libdv-0.102 failed.
Call stack:, line 1546:   Called dyn_compile, line 937:   Called src_compile
  libdv-0.102.ebuild, line 39:   Called die

!!! compile problem
!!! If you need support, post the topmost build error, and the call stack if relevant.

zeus / # 

When switching to gcc-3.4.6 before the compile runs through without problems. 

zeus / # emerge --info
Portage 2.1.1 (default-linux/x86/2006.1/desktop, gcc-4.1.1, glibc-2.4-r3, 2.6.17-gentoo-r4 x86_64)
System uname: 2.6.17-gentoo-r4 x86_64 AMD Athlon(tm) 64 X2 Dual Core Processor 4400+
Gentoo Base System version 1.12.4
Last Sync: Fri, 15 Sep 2006 03:00:06 +0000
distcc 2.18.3 i686-pc-linux-gnu (protocols 1 and 2) (default port 3632) [disabled]
ccache version 2.3 [disabled]
app-admin/eselect-compiler: [Not Present]
dev-lang/python:     2.3.5-r2, 2.4.3-r1
dev-python/pycrypto: 2.0.1-r5
dev-util/ccache:     2.3
dev-util/confcache:  [Not Present]
sys-apps/sandbox:    1.2.17
sys-devel/autoconf:  2.13, 2.59-r7
sys-devel/automake:  1.4_p6, 1.5, 1.6.3, 1.7.9-r1, 1.8.5-r3, 1.9.6-r2
sys-devel/binutils:  2.16.1-r3
sys-devel/gcc-config: 1.3.13-r3
sys-devel/libtool:   1.5.22
virtual/os-headers:  2.6.11-r5
CFLAGS="-march=k8 -O3 -pipe -msse2 -mmmx -mfpmath=sse -fomit-frame-pointer"
CONFIG_PROTECT="/etc /usr/kde/3.4/env /usr/kde/3.4/share/config /usr/kde/3.4/shutdown /usr/share/X11/xkb /usr/share/config"
CONFIG_PROTECT_MASK="/etc/env.d /etc/gconf /etc/terminfo"
CXXFLAGS="-march=k8 -O3 -pipe -msse2 -mmmx -mfpmath=sse -fomit-frame-pointer"
FEATURES="autoconfig buildpkg distlocks fixpackages metadata-transfer sandbox sfperms strict"
PORTAGE_RSYNC_OPTS="--recursive --links --safe-links --perms --times --compress --force --whole-file --delete --delete-after --stats --timeout=180 --exclude='/distfiles' --exclude='/local' --exclude='/packages'"
USE="x86 3dnow 3dnowext X a52 aac acpi alsa asf berkdb bigpatch bitmap-fonts bzip2 cairo cdda cddb cdr cli crypt css cups dbox2 dbus de_tvtoday dga divx djbfft dlloader dmi dri dv dvb dvbplayer dvd dvdr dvdread elibc_glibc enca encode esd exif fam fame fbcon fbsplash ffmpeg fftw firefox flac fuse gdbm gif glibc-omitfp hal id3 ieee1394 input_devices_evdev input_devices_keyboard input_devices_mouse ipod irda jpeg jpeg2k kernel_linux lame ldap libg++ lirc lirc_devices_devinput lm_sensors lzo lzw mad mikmod mjpeg mmx mmxext mng mp3 mp4 mp4live mpeg mpeg2 musepack ncurses netjack nls nptl nptlonly ogg openal opengl pam pcre pda perl pmount png ppds pppd python quicktime readline real reflection rtc sdl session spl sse sse2 ssl submenu subtitles taglib tcpd tga themes theora threads tiff transcode truetype truetype-fonts type1-fonts udev unicode userland_GNU v4l v4l2 vcd vdr video_cards_nvidia vorbis win32codecs x264 xine xml xorg xv yv12 zip zlib"
Comment 1 Jakub Moc (RETIRED) gentoo-dev 2006-09-15 09:29:34 UTC
Please, search...

*** This bug has been marked as a duplicate of 118073 ***