Gentoo Websites Logo
Go to: Gentoo Home Documentation Forums Lists Bugs Planet Store Wiki Get Gentoo!
Bug 144158 - net-misc/vnc-4.0-r1 failed to emerge
Summary: net-misc/vnc-4.0-r1 failed to emerge
Status: RESOLVED DUPLICATE of bug 125164
Alias: None
Product: Gentoo Linux
Classification: Unclassified
Component: New packages (show other bugs)
Hardware: x86 Linux
: Low normal (vote)
Assignee: Gentoo Linux bug wranglers
Depends on:
Reported: 2006-08-16 15:04 UTC by Richard Broersma Jr.
Modified: 2006-08-16 15:06 UTC (History)
0 users

See Also:
Package list:
Runtime testing required: ---


Note You need to log in before you can comment on or make changes to this bug.
Description Richard Broersma Jr. 2006-08-16 15:04:58 UTC
Portage 2.1.1_pre5-r1 (default-linux/x86/2005.1, gcc-4.1.1, glibc-2.3.6-r4, 2.6.16-gentoo-r12 i686)
System uname: 2.6.16-gentoo-r12 i686 AMD Athlon(tm) Processor
Gentoo Base System version 1.12.4
Last Sync: Wed, 16 Aug 2006 11:50:01 +0000
ccache version 2.3 [disabled]
app-admin/eselect-compiler: [Not Present]
dev-lang/python:     2.4.3-r1
dev-python/pycrypto: 2.0.1-r5
dev-util/ccache:     2.3
dev-util/confcache:  [Not Present]
sys-apps/sandbox:    1.2.17
sys-devel/autoconf:  2.13, 2.59-r7
sys-devel/automake:  1.4_p6, 1.5, 1.6.3, 1.7.9-r1, 1.8.5-r3, 1.9.6-r2
sys-devel/binutils:  2.16.1-r3
sys-devel/gcc-config: 1.3.13-r3
sys-devel/libtool:   1.5.22
virtual/os-headers:  2.6.11-r2
CFLAGS="-march=athlon-xp -O3 -pipe"
CONFIG_PROTECT="/etc /usr/share/X11/xkb /usr/share/config /usr/share/texmf/dvipdfm/config/ /usr/share/texmf/dvips/config/ /usr/share/texmf/tex/generic/config/ /usr/share/texmf/tex/platex/config/ /usr/share/texmf/xdvi/"
CONFIG_PROTECT_MASK="/etc/env.d /etc/gconf /etc/revdep-rebuild /etc/terminfo"
CXXFLAGS="-march=athlon-xp -O3 -pipe"
FEATURES="autoconfig distlocks metadata-transfer sandbox sfperms strict"
PORTAGE_RSYNC_OPTS="--recursive --links --safe-links --perms --times --compress --force --whole-file --delete --delete-after --stats --timeout=180 --exclude='/distfiles' --exclude='/local' --exclude='/packages'"
USE="x86 X alsa apm arts avi berkdb bitmap-fonts cli crypt cups dlloader dri eds elibc_glibc emboss encode examples foomaticdb fortran gcj gdbm gif gnome gpm gstreamer gtk gtk2 hal howl imlib input_devices_evdev input_devices_keyboard input_devices_mouse ipv6 isdnlog jpeg kde kernel_linux libg++ libwww mad maildir mikmod motif mp3 mpeg ncurses nls ogg oggvorbis opengl oss pam pcre pdflib perl png postgres pppd python qt3 qt4 quicktime readline reflection samba sasl sdl server session snmp spell spl ssl symlink tcltk tcpd truetype truetype-fonts type1-fonts unicode userland_GNU video_cards_radeon vorbis xml2 xmms xorg xv zlib"

here is the repeatable error:

attributes.c: In function 'XpGetConfigDirBase':
attributes.c:152: warning: assignment from incompatible pointer type
attributes.c:152: warning: comparison of distinct pointer types lacks a cast
attributes.c:153: warning: assignment from incompatible pointer type
attributes.c:155: warning: return from incompatible pointer type
attributes.c: In function 'BuildPrinterAttrs':
attributes.c:327: warning: unused variable 'dirName'
attributes.c: In function 'XpGetOneAttribute':
attributes.c:627: warning: unused variable 'retVal'
attributes.c: In function 'AppendEntry':
attributes.c:819: warning: 'return' with no value, in function returning non-void
attributes.c: In function 'XpGetAttributes':
attributes.c:878: warning: unused variable 'retVal'
attributes.c: At top level:
attributes.c:1094: error: static declaration of 'ExecCommand' follows non-static declaration
attributes.h:113: error: previous declaration of 'ExecCommand' was here
attributes.c: In function 'SendFileToCommand':
attributes.c:1187: warning: implicit declaration of function 'initgroups'
attributes.c:1202: warning: unused variable 'res'
attributes.c: In function 'VectorizeCommand':
attributes.c:1440: warning: unused variable 'i'
attributes.c:1439: warning: unused variable 'curTok'
attributes.c: In function 'XpSubmitJob':
attributes.c:1466: warning: unused variable 'cmdOpt'
attributes.c: In function 'XpGetTrayMediumFromContext':
attributes.c:1590: warning: unused variable 'pLast'
attributes.c:1590: warning: unused variable 'pE'
attributes.c:1590: warning: unused variable 'pS'
attributes.c: In function 'XpSubmitJob':
attributes.c:1518: warning: control reaches end of non-void function
make[5]: *** [attributes.o] Error 1
make[5]: Leaving directory `/var/tmp/portage/vnc-4.0-r1/work/vnc-4.0-unixsrc/xc/programs/Xserver/Xprint'
make[4]: *** [Xprint] Error 2
make[4]: Leaving directory `/var/tmp/portage/vnc-4.0-r1/work/vnc-4.0-unixsrc/xc/programs/Xserver'
make[3]: *** [all] Error 2
make[3]: Leaving directory `/var/tmp/portage/vnc-4.0-r1/work/vnc-4.0-unixsrc/xc/programs'
make[2]: *** [all] Error 2
make[2]: Leaving directory `/var/tmp/portage/vnc-4.0-r1/work/vnc-4.0-unixsrc/xc'
make[1]: *** [World] Error 2
make[1]: Leaving directory `/var/tmp/portage/vnc-4.0-r1/work/vnc-4.0-unixsrc/xc'
make: *** [World] Error 2

!!! ERROR: net-misc/vnc-4.0-r1 failed.
Call stack:, line 1543:   Called dyn_compile, line 938:   Called src_compile
  vnc-4.0-r1.ebuild, line 88:   Called die

!!! (no error message)
!!! If you need support, post the topmost build error, and the call stack if relevant.
Comment 1 Jakub Moc (RETIRED) gentoo-dev 2006-08-16 15:06:38 UTC

*** This bug has been marked as a duplicate of 125164 ***