Gentoo Websites Logo
Go to: Gentoo Home Documentation Forums Lists Bugs Planet Store Wiki Get Gentoo!
Bug 13077 - xfree- fails to compile
Summary: xfree- fails to compile
Alias: None
Product: Gentoo Linux
Classification: Unclassified
Component: Current packages (show other bugs)
Hardware: Sparc Linux
: Lowest normal (vote)
Assignee: Sparc Porters
Depends on:
Reported: 2003-01-02 03:15 UTC by Joshua Kinard
Modified: 2003-03-06 07:23 UTC (History)
1 user (show)

See Also:
Package list:
Runtime testing required: ---


Note You need to log in before you can comment on or make changes to this bug.
Description Joshua Kinard gentoo-dev 2003-01-02 03:15:25 UTC
making all in programs/Xserver/hw/xfree86/etc...
make[5]: Entering directory
rm -f scanpci
gcc -o scanpci -mcpu=ultrasparc -O3 -pipe -ansi -pedantic -Wall -Wpointer-arith
-Wstrict-prototypes -Wmissing-prototypes -Wmissing-declarations
-Wredundant-decls -Wnested-externs -Wundef     -L../../../../../exports/lib  
scanpci.o -L../os-support -lxf86_os -L../scanpci -lscanpci -L../dummylib -ldummy
../os-support/libxf86_os.a(Pci.o)(.text+0x1450): In function `xf86scanpci':
: undefined reference to `sparcPciPciBridge'
collect2: ld returned 1 exit status
make[5]: *** [scanpci] Error 1
make[5]: Leaving directory
make[4]: *** [all] Error 2
make[4]: Leaving directory
make[3]: *** [hw/xfree86] Error 2
make[3]: Leaving directory
make[2]: *** [install] Error 2
make[2]: Leaving directory `/usr/obj/portage/xfree-'
make[1]: *** [install] Error 2
make[1]: Leaving directory `/usr/obj/portage/xfree-'
make: *** [install] Error 2

!!! ERROR: x11-base/xfree- failed.
!!! Function src_install, Line 326, Exitcode 2
!!! (no error message)
Comment 1 Jason Wever (RETIRED) gentoo-dev 2003-01-22 06:41:28 UTC
Seeing the same on al Ultra 5.  Will look into it when there's more time.  For 
now changing priority to P5 as it's not a 1.4 priority.
Comment 2 Jason Wever (RETIRED) gentoo-dev 2003-02-04 14:18:42 UTC
New version X fixes this issue. 
Comment 3 Jason Wever (RETIRED) gentoo-dev 2003-03-06 07:23:14 UTC
Problem resolved by upgrade, closing.