Gentoo Websites Logo
Go to: Gentoo Home Documentation Forums Lists Bugs Planet Store Wiki Get Gentoo!
Votes Bug # Summary
Gentoo Linux (bug list)
1 222601 net-dns/avahi - circular dependency: avahi -> gtk+ -> cups -> avahi (Show Votes)
1 408963 [TRACKER] Support LLVM/Clang as alternative system compiler (Show Votes)
1 492312 Reintroduce hardened desktop profiles (Show Votes)
1 498886 sci-biology/foldingathome - add install options through USE flags for FAHviewer and FAHcontrol (Show Votes)
1 506276 [TRACKER] SYMLINK_LIB=no / 17.1 profiles [FILE A SEPARATE BUG INSTEAD OF COMMENTING HERE!] (Show Votes)
1 561706 x11-drivers/nvidia-drivers should install CUDA/OpenCL libraries separately from USE=X (Show Votes)
1 561854 [TRACKER] LibreSSL support in gentoo (Show Votes)
1 581558 www-apps/openproject: web-based project management system similar to MS Project (Show Votes)
1 600182 >=x11-drivers/nvidia-drivers-355.11-r2[-X] - missing libraries needed for headless Cuda computing (Show Votes)
1 616108 =media-libs/alsa-lib-1.1.3 fails to build with LTO -- error: undefined reference to 'snd_timer_params_set_filter' (Show Votes)
1 618550 [TRACKER] LTO issues (Show Votes)
1 643004 app-misc/anki-2.1.0_beta27: Missing dependency on qt >= 5.9 (Show Votes)
1 644538 dev-util/cmake: stores incorrect paths to lib64 libraries (?) (Show Votes)
1 645314 app-misc/anki-2.1.0_beta27 USE=-recording - ModuleNotFoundError: No module named 'pyaudio' (Show Votes)
1 650874 sys-fs/fuse-3*: undefined reference to `fuse_new' (Show Votes)
1 651740 net-misc/openssh[debug]: In file included from sandbox-seccomp-filter.c:38: /usr/include/bits/types/sigval_t.h:5:7: error: redefinition of ‘union sigval’ (Show Votes)
1 651770 media-sound/spotify-1.0.72 fails to start with missing symbol "CURL_OPENSSL_3" when net-misc/curl is built with ld.gold (Show Votes)
1 652158 dev-qt/qtscript-5.9.4 with -flto - .../temp/ccKpdSnw.ltrans0.ltrans.o: In function `ctiVMThrowTrampoline': <artificial>:(.text+0x4c): undefined reference to `cti_vm_throw' (Show Votes)
1 663234 >=x11-drivers/nvidia-drivers-396 should check for CONFIG_NUMA to enable CUDA library usage (Show Votes)
1 663834 dev-util/nvidia-cuda-toolkit should not require x11-drivers/nvidia-drivers to be built with X use flag (Show Votes)
1 667362 x11-drivers/nvidia-drivers-410.57 - timeouts when loading modules (Show Votes)
1 687686 sci-electronics/kicad-5.1.2 with amd64/17.1 profile - No rule to make target '/usr/lib/libtbb.so', needed by 'plugins/3d/oce/libs3d_plugin_oce.so' (Show Votes)
1 699236 sci-electronics/kicad-5.1.4 with amd64/17.1 profile - No rule to make target '/usr/lib/libSM.so', needed by 'utils/kicad2step/kicad2step' (Show Votes)
1 699242 x11-libs/gtk+-3.24.8 - ld: /usr/lib/libatk-bridge-2.0.so: error adding symbols: file in wrong format (Show Votes)
1 703824 dev-qt/qtgui-5.14.0-r1: multiple definition of `__bss_start' and more (Show Votes)
1 705764 [TRACKER] Packages failing with -fno-common (Show Votes)
1 706426 [TRACKER] sys-devel/gcc-10 porting (Show Votes)
1 707764 sys-libs/compiler-rt-sanitizers-9.0.1: compiler-rt/lib/xray/xray_buffer_queue.h:21:10: fatal error: 'cstddef' file not found; while using gcc-10 (Show Votes)
1 707892 sci-electronics/geda-1.9.2-r1 : fails to build with -fno-common or gcc-10 (Show Votes)
1 715610 sci-libs/cholmod-3.0.13: emake failed: nvcc fatal: Unknown option '-fPIC' (Show Votes)
1 715612 dev-util/llvm-polly: Polly - Polyhedral optimizations for LLVM (Show Votes)
1 716958 net-libs/google-cloud-cpp-0.10.0 : make[2]: *** No rule to make target external/lib/libgoogleapis_cpp_bigtable_protos.so, needed b (Show Votes)
1 724672 media-gfx/inkscape-1.0: doesn't start when built with jemalloc (Show Votes)
1 729916 net-misc/ntp-4.2.8_p15 - ld: run-t-log.o:(.bss.progname+0x0): multiple definition of `progname'; t-log.o:(.bss.progname+0x0): first defined here (Show Votes)
1 739782 sys-kernel/ck-sources-5.7: version bump (Show Votes)
1 758614 net-libs/webkit-gtk-2.30.3: fails to configure looking for pthread.h (Show Votes)
36 votes used out of 50 allowed.

Portage Development (bug list)
1 300071 [TRACKER] Portage dependency conflict resolution (Show Votes)
1 559354 sys-apps/portage: add emerge option which directs it to "update any packages necessary" (which --update does not do) (Show Votes)
1 672914 sys-apps/portage: add emerge --rebuild-if-conflict option (Show Votes)
1 698920 sys-apps/portage feature request: "Soft" USE flag specification in package.use (Show Votes)
4 votes used out of 10 allowed.

View all as bug list

Help with voting.