Gentoo Websites Logo
Go to: Gentoo Home Documentation Forums Lists Bugs Planet Store Wiki Get Gentoo!
Votes Bug # Summary
Gentoo Hosted Projects (bug list)
1 327701 [Future EAPI] Recommended / suggested dependencies (Show Votes)
1 vote used out of 5 allowed.

Gentoo Linux (bug list)
1 334329 net-analyzer/tcpdump[chroot] dropping privileges causes inconsistent dump file location to be used (Show Votes)
1 405765 net-analyzer/rrdtool-1.4.5-r2 - main.c:(.text+0x26c): undefined reference to `rrd_xport' (Show Votes)
1 456938 dev-perl/XML-SAX-0.990.0, dev-perl/XML-SAX-Base-1.80.0: Fail to remove vendor_perl/.../ParserDetails.ini on unmerge (Show Votes)
1 543870 media-libs/libcaca-0.99_beta19 USE=doc with >=app-doc/doxygen-1.8.8 - Makefile:6: recipe for target 'refman.pdf' failed (Show Votes)
1 546874 app-crypt/heimdal-1.5.3-r2 underlinking issue causes samba-4.1.17 to fail (Show Votes)
1 584668 dev-util/emilpro-3-r3 : /.../ld: CMakeFiles/.../model.cc.o: undefined reference to symbol 'pthread_create@@GLIBC_2.2.5' (Show Votes)
1 585658 sys-apps/kexec-tools: systemd unit does not allow more than one commandline argument (Show Votes)
1 592718 media-gfx/fontypython - Fonts not rendered in the font preview. A fallback font is used instead. (Show Votes)
1 594316 media-gfx/povray-3.7.0.0-r1 : configure.ac:171: error: required file 'unix/config/ar-lib' not found (Show Votes)
1 612248 sys-process/atop ebuild needs to also build netatop kernel module (Show Votes)
1 616010 media-libs/lv2-1.14.0[doc] - Impossible to get ontology's namespace (Show Votes)
1 629736 sys-cluster/mpich-3.2-r1 : collect2: error: ld returned 1 exit status (Show Votes)
1 634066 media-gfx/povray-3.7.0.0-r1: configure: error: Could not find a version of the library! (Show Votes)
1 638476 app-emulation/bochs-2.6.9 : slirp/cksum.cc:83:12: error: uintptr_t was not declared in this scope (Show Votes)
1 642120 media-libs/libcaca-0.99_beta19 (with dev-dotnet/mono-5.4.1.6)- error CS7027: Error signing output with public key from file '/var/tmp/portage/media-libs/libcaca-0.99_beta19/work/libcaca-0.99.beta19/caca-sharp/caca-sharp.snk' -- mscoree.dll (Show Votes)
1 644538 dev-util/cmake: stores incorrect paths to lib64 libraries (?) (Show Votes)
1 644772 sys-devel/gcc: (with sys-devel/llvmgold) - ../libtool: line 1132: 8323 Segmentation fault /usr/x86_64-pc-linux-gnu/bin/ar rc .libs/libstdc++.a compatibility.o compatibility-debug_list.o ... (Show Votes)
1 645256 media-sound/sndfile-tools-1.04 : file collision with media-libs/libsamplerate-0.1.9 (Show Votes)
1 646318 app-emulation/bochs-2.6.9: cksum.cc:83:12: error: uintptr_t was not declared in this scope (Show Votes)
1 659436 dev-dotnet/mono-addins-1.0-r1 : sandbox issue (Show Votes)
1 663468 media-gfx/inkscape fails to build with =media-gfx/imagemagick-7*: ‘MatteChannel’ is not a member of ‘Magick’ (Show Votes)
1 672816 >=dev-lang/rust-1.31.0 installs `codegen-backends` folder in wrong path (in some cases) (Show Votes)
1 672946 >=dev-qt/qtgui-5.12 - In file included from painting/qdrawhelper_avx2.cpp:40: /usr/lib/gcc/x86_64-pc-linux-gnu/7.3.0/include/avx2intrin.h:574:1: error: inlining failed in call to always_inline ‘__m256i _mm256_or_si256(__m256i, __m256i)’: target (Show Votes)
1 674284 net-firewall/iptables-1.8.2-r2 with net-firewall/arptables - file collisions in /sbin/arptables-save /sbin/arptables-restore (Show Votes)
1 676276 xfce-base/thunar-1.8.3 with gnome-base/nautilus-3.26.4-r2 - file collision at /usr/share/dbus-1/services/org.freedesktop.FileManager1.service (Show Votes)
1 679194 [TRACKER] packages failing with =dev-libs/openssl-1.1.1* (Show Votes)
1 683796 kde-apps/ktp-call-ui - ninja: error: '/usr/lib/libtelepathy-farstream.so', needed by 'src/ktp-call-ui', missing and no known rule to make it (Show Votes)
1 684722 media-sound/musescore-3.3* : ninja: error: dependency cycle: mops1 -> CMakeFiles/mops1 -> all.h -> libmscore/libmscore_autogen -> libmscore/CMakeFiles/libmscore_autogen -> mops1 (Show Votes)
1 685712 sys-apps/pick-3.0.1 needs a patch for tinfo (Show Votes)
1 688658 app-doc/doxygen-1.8.16: with USE=doc [doc/CMakeFiles/doxygen_pdf.dir/build.make:62: doc/CMakeFiles/doxygen_pdf] Error 1 (Show Votes)
1 688722 media-gfx/pinta-1.6-r2: Classes/IExtension.cs(5,12): error CS0234: The type or namespace name `Addins' does not exist in the namespace `Mono'. Are you missing an assembly reference? (Show Votes)
1 690294 [tracker] things that need to be fixed to allow the usr merge to work (Show Votes)
1 691156 sys-apps/pick-3.0.1 : collect2: error: ld returned 1 exit status (Show Votes)
1 691274 media-libs/rubberband-1.8.2 misconfigured /usr/lib64/pkgconfig/rubberband.pc causing issues with systems running the 17.1 profile (Show Votes)
1 691846 [TRACKER] Issues with sys-libs/glibc-2.30 (directly and indirectly) (Show Votes)
1 692512 =media-sound/denemo-2.3.0 USE=jack fails with ld: error: //usr/lib/libjack.so: incompatible target - on x86 multilib (Show Votes)
1 695484 x11-terms/pangoterm-0.0_pre20171111 : pangoterm.c:67:32: error: VTermColor {aka union <anonymous> } has no member named red (Show Votes)
1 703888 net-dns/getdns-1.6.0_beta1 : * multilib-strict check failed! (Show Votes)
1 707848 dev-util/mutrace-0.2-r1 : backtrace-symbols.c:138:9: error: too many arguments to function bfd_section_size (Show Votes)
1 708430 sys-libs/compiler-rt-sanitizers-9.0.1 with sys-libs/glibc-2.31 - .../work/compiler-rt/lib/sanitizer_common/sanitizer_platform_limits_posix.cc:1131:1: error: 'assertion_failed__1131' declared as an array with a negative size (Show Votes)
1 708598 net-misc/chrome-remote-desktop - restore package (Show Votes)
1 709930 x11-drivers/nvidia-drivers-390.132-r1 - raise maximum kernel version (Show Votes)
1 713366 app-backup/bup: needs py3 port (Show Votes)
1 716358 media-gfx/darktable-3.0.1 fails to build with USE=opencl (Show Votes)
1 720748 net-misc/teamviewer-15.5.3 checksum failure (Show Votes)
1 724650 media-video/handbrake-1.3.2 fails to build: undefined reference to symbol 'x265_api_query' (Show Votes)
1 726046 app-office/scribus-1.5.5-r1 with Qt 5.15: " error: aggregate ‘QPainterPath path’ has incomplete type and cannot be defined" (Show Votes)
47 votes used out of 50 allowed.

Gentoo Security (bug list)
1 125902 <games-roguelike/nethack-3.4.3-r2: local privilege escalation and insecure savegame creation (CVE-2006-1390) (Show Votes)
1 vote used out of 5 allowed.

Portage Development (bug list)
1 263630 enhancement proposal for --keep-going with blockers in the depgraph after a failure. (Show Votes)
1 328343 emerge should be able to cope with unsatisfied dependencies by pruning off unsolvable parts of the graph (Show Votes)
1 419381 sys-apps/portage-2.2.0_alpha109: emerge autounmask comment shows confusing "required by" dependency graph (Show Votes)
1 554838 >=sys-apps/portage-2.2.20 --update @world sees dev-util/boost-build-1.56.0 masks where there are none (Show Votes)
1 568902 revdep-rebuild wants to rebuild libreoffice but not revdep-rebuild.sh (Show Votes)
1 599894 sys-apps/sandbox-2.11: programs misbehave/crash when prelinked (Show Votes)
1 624660 euse in app-portage/gentoolkit can't handle dev-python/PyQt5 (Show Votes)
7 votes used out of 10 allowed.

View all as bug list

Help with voting.