1462 tests considered #### Something failed. Exiting with error status. make[2]: *** [Makefile:329: report] Error 4 make[1]: *** [Makefile:166: all] Error 2 make[1]: Leaving directory '/var/tmp/portage/dev-lang/ocaml-5.3.0-r1/work/ocaml-5.3.0/testsuite' make: *** [Makefile:927: tests] Error 2 * ERROR: dev-lang/ocaml-5.3.0-r1::gentoo failed (test phase): * emake failed ------------------------------------------------------------------- This is an unstable amd64 chroot image at a tinderbox (==build bot) name: 23.0_desktop_systemd_test-20250316-075502 KEYWORDED/UNMASKED [go-1.24] Requested by WilliamH - maybe block bug 950018 <dev-lang/go-9999 The attached etc.portage.tar.xz has all details. ------------------------------------------------------------------- gcc-config -l: [1] x86_64-pc-linux-gnu-14 * clang version 20.1.0 llvm-config: 20.1.0 Python 3.12.9 go version go1.24.1 linux/amd64 Available Ruby profiles: [1] ruby32 (with Rubygems) [2] ruby33 (with Rubygems) * Available Rust versions: [1] rust-bin-1.85.0 * The following VMs are available for generation-2: *) Eclipse Temurin JDK 21.0.6_p7 [openjdk-bin-21] Available Java Virtual Machines: [1] openjdk-bin-21 system-vm HEAD of ::gentoo commit ad7dcbcb9724ee391d3b7800074216f428db044a Author: Repository mirror & CI <repomirrorci@gentoo.org> Date: Tue Mar 18 02:04:11 2025 +0000 2025-03-18 02:04:11 UTC emerge -qpvO =dev-lang/ocaml-5.3.0-r1 [ebuild N ] dev-lang/ocaml-5.3.0-r1 USE="flambda test -emacs -latex -ocamlopt -xemacs"
Created attachment 921097 [details] emerge-info.txt
Created attachment 921098 [details] dev-lang:ocaml-5.3.0-r1:20250318-023717.log.xz
Created attachment 921099 [details] emerge-history.txt
Created attachment 921100 [details] environment
Created attachment 921101 [details] etc.clang.tar.xz
Created attachment 921102 [details] etc.portage.tar.xz
Created attachment 921103 [details] logs.tar.xz
Created attachment 921104 [details] qlist-info.txt
Created attachment 921105 [details] temp.tar.xz