Gentoo Websites Logo
Go to: Gentoo Home Documentation Forums Lists Bugs Planet Store Wiki Get Gentoo!
Bug 936965 - [guru] dev-python/python-statemachine-2.3.4 fails tests: FAILED test_contrib_diagram.py::test_machine_repr_custom_[expected_reprs0-AllActionsMachine] - AssertionError: dot with args [-Tsvg, tmpuh0qfpkv] returned code: 1
Summary: [guru] dev-python/python-statemachine-2.3.4 fails tests: FAILED test_contrib_...
Status: RESOLVED FIXED
Alias: None
Product: GURU
Classification: Unclassified
Component: Package issues (show other bugs)
Hardware: All Linux
: Normal normal
Assignee: David Roman
URL:
Whiteboard:
Keywords: TESTFAILURE
Depends on:
Blocks:
 
Reported: 2024-07-31 06:39 UTC by Agostino Sarubbo
Modified: 2024-09-09 15:25 UTC (History)
1 user (show)

See Also:
Package list:
Runtime testing required: ---


Attachments
build.log (build.log,124.72 KB, text/plain)
2024-07-31 06:39 UTC, Agostino Sarubbo
Details

Note You need to log in before you can comment on or make changes to this bug.
Description Agostino Sarubbo gentoo-dev 2024-07-31 06:39:43 UTC
https://blogs.gentoo.org/ago/2020/07/04/gentoo-tinderbox/

Issue: dev-python/python-statemachine-2.3.4 fails tests.
Discovered on: amd64 (internal ref: guru_ci)

Info about the issue:
https://wiki.gentoo.org/wiki/Project:Tinderbox/Common_Issues_Helper#CF0015
Comment 1 Agostino Sarubbo gentoo-dev 2024-07-31 06:39:44 UTC
Created attachment 898681 [details]
build.log

build log and emerge --info
Comment 2 Agostino Sarubbo gentoo-dev 2024-07-31 06:39:45 UTC
Error(s) that match a know pattern in addition to what has been reported in the summary:


 b"temachine-2.3.4/temp/tmp014mnnzs: syntax error in line 6 near ','
 b"temachine-2.3.4/temp/tmpcwf9n9jw: syntax error in line 6 near ','
 b"temachine-2.3.4/temp/tmpdb7kkzxi: syntax error in line 6 near ','
 b"temachine-2.3.4/temp/tmpuh0qfpkv: syntax error in line 6 near ','
 b"temachine-2.3.4/temp/tmpvowju633: syntax error in line 6 near ','
 b'633 splits into two tokens
 b'9jw splits into two tokens
 b'nzs splits into two tokens
 b'pkv splits into two tokens
 b'zxi splits into two tokens
"
")
E       AssertionError: "dot" with args ['-Tsvg', '/var/tmp/portage/dev-python/python-statemachine-2.3.4/temp/tmp014mnnzs'] returned code: 1
E       AssertionError: "dot" with args ['-Tsvg', '/var/tmp/portage/dev-python/python-statemachine-2.3.4/temp/tmpcwf9n9jw'] returned code: 1
E       AssertionError: "dot" with args ['-Tsvg', '/var/tmp/portage/dev-python/python-statemachine-2.3.4/temp/tmpdb7kkzxi'] returned code: 1
E       AssertionError: "dot" with args ['-Tsvg', '/var/tmp/portage/dev-python/python-statemachine-2.3.4/temp/tmpuh0qfpkv'] returned code: 1
E       AssertionError: "dot" with args ['-Tsvg', '/var/tmp/portage/dev-python/python-statemachine-2.3.4/temp/tmpvowju633'] returned code: 1
Error: /var/tmp/portage/dev-python/python-sta'
Error: /var/tmp/portage/dev-python/python-statemachine-2.3.4/temp/tmp014mnnzs: syntax error in line 6 near ','
Error: /var/tmp/portage/dev-python/python-statemachine-2.3.4/temp/tmpcwf9n9jw: syntax error in line 6 near ','
Error: /var/tmp/portage/dev-python/python-statemachine-2.3.4/temp/tmpdb7kkzxi: syntax error in line 6 near ','
Error: /var/tmp/portage/dev-python/python-statemachine-2.3.4/temp/tmpuh0qfpkv: syntax error in line 6 near ','
Error: /var/tmp/portage/dev-python/python-statemachine-2.3.4/temp/tmpvowju633: syntax error in line 6 near ','
FAILED tests/test_contrib_diagram.py::TestDiagramCmdLine::test_generate_image - AssertionError: "dot" with args ['-Tsvg', '/var/tmp/portage/dev-python/python-statemachine-2.3.4/temp/tmpvowju633'] returned code: 1
FAILED tests/test_contrib_diagram.py::test_machine_repr_custom_[expected_reprs0-AllActionsMachine] - AssertionError: "dot" with args ['-Tsvg', '/var/tmp/portage/dev-python/python-statemachine-2.3.4/temp/tmpuh0qfpkv'] returned code: 1
FAILED tests/test_contrib_diagram.py::test_machine_repr_custom_[expected_reprs0-OrderControl] - AssertionError: "dot" with args ['-Tsvg', '/var/tmp/portage/dev-python/python-statemachine-2.3.4/temp/tmpcwf9n9jw'] returned code: 1
FAILED tests/test_contrib_diagram.py::test_machine_repr_custom_[expected_reprs1-AllActionsMachine] - AssertionError: "dot" with args ['-Tsvg', '/var/tmp/portage/dev-python/python-statemachine-2.3.4/temp/tmp014mnnzs'] returned code: 1
FAILED tests/test_contrib_diagram.py::test_machine_repr_custom_[expected_reprs1-OrderControl] - AssertionError: "dot" with args ['-Tsvg', '/var/tmp/portage/dev-python/python-statemachine-2.3.4/temp/tmpdb7kkzxi'] returned code: 1
Warning: syntax ambiguity - badly delimited number '1p' in line 6 of /var/tmp/portage/dev-python/python-statemachine-2.3.4/temp/tmp014mnnzs splits into two tokens
Warning: syntax ambiguity - badly delimited number '1p' in line 6 of /var/tmp/portage/dev-python/python-statemachine-2.3.4/temp/tmpcwf9n9jw splits into two tokens
Warning: syntax ambiguity - badly delimited number '1p' in line 6 of /var/tmp/portage/dev-python/python-statemachine-2.3.4/temp/tmpdb7kkzxi splits into two tokens
Warning: syntax ambiguity - badly delimited number '1p' in line 6 of /var/tmp/portage/dev-python/python-statemachine-2.3.4/temp/tmpuh0qfpkv splits into two tokens
Warning: syntax ambiguity - badly delimited number '1p' in line 6 of /var/tmp/portage/dev-python/python-statemachine-2.3.4/temp/tmpvowju633 splits into two tokens
b"Warning: syntax ambiguity - badly delimited number '10p' in line 4 of /var/tmp/portage/dev-python/python-statemachine-2.3.4/temp/tmp014mnnzs splits into two tokens
b"Warning: syntax ambiguity - badly delimited number '10p' in line 4 of /var/tmp/portage/dev-python/python-statemachine-2.3.4/temp/tmpcwf9n9jw splits into two tokens
b"Warning: syntax ambiguity - badly delimited number '10p' in line 4 of /var/tmp/portage/dev-python/python-statemachine-2.3.4/temp/tmpdb7kkzxi splits into two tokens
b"Warning: syntax ambiguity - badly delimited number '10p' in line 4 of /var/tmp/portage/dev-python/python-statemachine-2.3.4/temp/tmpuh0qfpkv splits into two tokens
b"Warning: syntax ambiguity - badly delimited number '10p' in line 4 of /var/tmp/portage/dev-python/python-statemachine-2.3.4/temp/tmpvowju633 splits into two tokens
tests/test_contrib_diagram.py::TestDiagramCmdLine::test_generate_image FAILED [ 25/229]
tests/test_contrib_diagram.py::test_machine_repr_custom_[expected_reprs0-AllActionsMachine] FAILED [ 20/229]
tests/test_contrib_diagram.py::test_machine_repr_custom_[expected_reprs0-OrderControl] FAILED [ 21/229]
tests/test_contrib_diagram.py::test_machine_repr_custom_[expected_reprs1-AllActionsMachine] FAILED [ 22/229]
tests/test_contrib_diagram.py::test_machine_repr_custom_[expected_reprs1-OrderControl] FAILED [ 23/229]
Comment 3 Larry the Git Cow gentoo-dev 2024-09-09 15:25:22 UTC
The bug has been closed via the following commit(s):

https://gitweb.gentoo.org/repo/proj/guru.git/commit/?id=e0f6fd0ceff2d45fe9b210e3ea258f9657646148

commit e0f6fd0ceff2d45fe9b210e3ea258f9657646148
Author:     David Roman <davidroman96@gmail.com>
AuthorDate: 2024-09-09 15:19:30 +0000
Commit:     David Roman <davidroman96@gmail.com>
CommitDate: 2024-09-09 15:19:39 +0000

    dev-python/python-statemachine: add 2.3.5
    
    Closes: https://bugs.gentoo.org/936965
    Signed-off-by: David Roman <davidroman96@gmail.com>

 dev-python/python-statemachine/Manifest            |  1 +
 .../python-statemachine-2.3.5.ebuild               | 48 ++++++++++++++++++++++
 2 files changed, 49 insertions(+)