Gentoo Websites Logo
Go to: Gentoo Home Documentation Forums Lists Bugs Planet Store Wiki Get Gentoo!
Bug 930272 - dev-python/py-ubjson-0.16.1-r1 fails tests: AssertionError: RuntimeError not raised
Summary: dev-python/py-ubjson-0.16.1-r1 fails tests: AssertionError: RuntimeError not ...
Status: RESOLVED FIXED
Alias: None
Product: Gentoo Linux
Classification: Unclassified
Component: Current packages (show other bugs)
Hardware: All Linux
: Normal normal
Assignee: Python Gentoo Team
URL:
Whiteboard:
Keywords: TESTFAILURE
Depends on:
Blocks:
 
Reported: 2024-04-20 07:26 UTC by Agostino Sarubbo
Modified: 2024-06-30 17:51 UTC (History)
1 user (show)

See Also:
Package list:
Runtime testing required: ---


Attachments
build.log (build.log,100.18 KB, text/plain)
2024-04-20 07:26 UTC, Agostino Sarubbo
Details

Note You need to log in before you can comment on or make changes to this bug.
Description Agostino Sarubbo gentoo-dev 2024-04-20 07:26:04 UTC
https://blogs.gentoo.org/ago/2020/07/04/gentoo-tinderbox/

Issue: dev-python/py-ubjson-0.16.1-r1 fails tests.
Discovered on: amd64 (internal ref: gcc14_tinderbox)
System: GCC-14-SYSTEM (https://wiki.gentoo.org/wiki/Project:Tinderbox/Common_Issues_Helper#GCC-14)

Info about the issue:
https://wiki.gentoo.org/wiki/Project:Tinderbox/Common_Issues_Helper#CF0015
Comment 1 Agostino Sarubbo gentoo-dev 2024-04-20 07:26:05 UTC
Created attachment 891152 [details]
build.log

build log and emerge --info
Comment 2 Agostino Sarubbo gentoo-dev 2024-04-20 07:26:06 UTC
Error(s) that match a know pattern in addition to what has been reported in the summary:


AssertionError: RuntimeError not raised
ERROR setuptools_scm._file_finders.git listing git files failed - pretending there aren't any
FAIL: test_recursion (test.TestEncodeDecodeFpExt.test_recursion)
FAIL: test_recursion (test.TestEncodeDecodePlainExt.test_recursion)
FAILED (failures=2)
Comment 3 Larry the Git Cow gentoo-dev 2024-06-30 17:51:51 UTC
The bug has been closed via the following commit(s):

https://gitweb.gentoo.org/repo/gentoo.git/commit/?id=ee582437824e80dc8ef4b5835a8d1da26515c055

commit ee582437824e80dc8ef4b5835a8d1da26515c055
Author:     Michał Górny <mgorny@gentoo.org>
AuthorDate: 2024-06-30 17:48:34 +0000
Commit:     Michał Górny <mgorny@gentoo.org>
CommitDate: 2024-06-30 17:51:45 +0000

    dev-python/py-ubjson: Deselect failing tests
    
    Closes: https://bugs.gentoo.org/930272
    Signed-off-by: Michał Górny <mgorny@gentoo.org>

 dev-python/py-ubjson/py-ubjson-0.16.1-r1.ebuild | 13 ++++++++++---
 1 file changed, 10 insertions(+), 3 deletions(-)