Gentoo Websites Logo
Go to: Gentoo Home Documentation Forums Lists Bugs Planet Store Wiki Get Gentoo!
Bug 920919 - dev-libs/intel-metrics-discovery-1.12.170 - [clang] clang++: error: argument unused during compilation: -pie [-Werror,-Wunused-command-line-argument]
Summary: dev-libs/intel-metrics-discovery-1.12.170 - [clang] clang++: error: argument ...
Status: RESOLVED FIXED
Alias: None
Product: Gentoo Linux
Classification: Unclassified
Component: Current packages (show other bugs)
Hardware: All Linux
: Normal normal
Assignee: Jan Henke
URL:
Whiteboard:
Keywords:
Depends on:
Blocks:
 
Reported: 2023-12-29 09:22 UTC by Toralf Förster
Modified: 2024-01-23 20:07 UTC (History)
4 users (show)

See Also:
Package list:
Runtime testing required: ---


Attachments
emerge-info.txt (emerge-info.txt,20.28 KB, text/plain)
2023-12-29 09:22 UTC, Toralf Förster
Details
dev-libs:intel-metrics-discovery-1.12.170:20231229-045211.log (dev-libs:intel-metrics-discovery-1.12.170:20231229-045211.log,27.87 KB, text/plain)
2023-12-29 09:22 UTC, Toralf Förster
Details
emerge-history.txt (emerge-history.txt,210.67 KB, text/plain)
2023-12-29 09:22 UTC, Toralf Förster
Details
environment (environment,107.77 KB, text/plain)
2023-12-29 09:22 UTC, Toralf Förster
Details
etc.clang.tar.xz (etc.clang.tar.xz,1.12 KB, application/x-xz)
2023-12-29 09:22 UTC, Toralf Förster
Details
etc.portage.tar.xz (etc.portage.tar.xz,24.97 KB, application/x-xz)
2023-12-29 09:22 UTC, Toralf Förster
Details
qlist-info.txt.xz (qlist-info.txt.xz,55.48 KB, application/x-xz)
2023-12-29 09:22 UTC, Toralf Förster
Details
temp.tar.xz (temp.tar.xz,35.84 KB, application/x-xz)
2023-12-29 09:22 UTC, Toralf Förster
Details
var.tmp.clang.tar.xz (var.tmp.clang.tar.xz,7.45 KB, application/x-xz)
2023-12-29 09:22 UTC, Toralf Förster
Details

Note You need to log in before you can comment on or make changes to this bug.
Description Toralf Förster gentoo-dev 2023-12-29 09:22:39 UTC
too long lines were shrinked:

 * Source directory (CMAKE_USE_DIR): "/var/tmp/portage/dev-libs/intel-metrics-discovery-1.12.170/work/metrics-discovery-metrics-discovery-1.12.170"
 * Build directory  (BUILD_DIR):     "/var/tmp/portage/dev-libs/intel-metrics-discovery-1.12.170/work/metrics-discovery-metrics-discovery-1.12.170_build"
ninja -v -j4 -l0
[1/87] /usr/lib/llvm/17/bin/clang++ -DMD_USE_PERF -DMETRICS_DISCOVERY -DNDEBUG -D_FORTIFY_SOURCE=2 -Dmetrics_discovery_EXPORTS -I/var/tmp/portage/dev-libs/intel-metrics-discovery-1.12.170/work/metrics-discovery-metrics-discovery-1.12.170/instrumentation/metrics_discovery/common/inc -I/var/tmp/portag
FAILED: CMakeFiles/metrics_discovery.dir/instrumentation/metrics_discovery/codegen/md_metrics_HSW.cpp.o 
/usr/lib/llvm/17/bin/clang++ -DMD_USE_PERF -DMETRICS_DISCOVERY -DNDEBUG -D_FORTIFY_SOURCE=2 -Dmetrics_discovery_EXPORTS -I/var/tmp/portage/dev-libs/intel-metrics-discovery-1.12.170/work/metrics-discovery-metrics-discovery-1.12.170/instrumentation/metrics_discovery/common/inc -I/var/tmp/portage/dev-l
clang++: error: argument unused during compilation: '-pie' [-Werror,-Wunused-command-line-argument]
[2/87] /usr/lib/llvm/17/bin/clang++ -DMD_USE_PERF -DMETRICS_DISCOVERY -DNDEBUG -D_FORTIFY_SOURCE=2 -Dmetrics_discovery_EXPORTS -I/var/tmp/portage/dev-libs/intel-metrics-discovery-1.12.170/work/metrics-discovery-metrics-discovery-1.12.170/instrumentation/metrics_discovery/common/inc -I/var/tmp/portag
FAILED: CMakeFiles/metrics_discovery.dir/instrumentation/metrics_discovery/codegen/md_metrics_SKL_GT3.cpp.o 

  -------------------------------------------------------------------

  This is an unstable amd64 chroot image at a tinderbox (==build bot)
  name: 17.1_desktop_plasma-20231225-172010

  -------------------------------------------------------------------

CC=clang
CXX=clang++
gcc-config -l:
 [1] x86_64-pc-linux-gnu-10
 [2] x86_64-pc-linux-gnu-13 *
clang/llvm (if any):
clang version 17.0.6
Target: x86_64-pc-linux-gnu
Thread model: posix
InstalledDir: /usr/lib/llvm/17/bin
Configuration file: /etc/clang/x86_64-pc-linux-gnu-clang.cfg
/usr/lib/llvm/17
17.0.6
Python 3.11.7
Available Ruby profiles:
  (none found)
Available Rust versions:
  [1]   rust-bin-1.74.1 *
The following VMs are available for generation-2:
1)	Eclipse Temurin JDK 11.0.20.1_p1 [openjdk-bin-11]
2)	Eclipse Temurin JDK 17.0.8.1_p1 [openjdk-bin-17]
*)	Eclipse Temurin JDK 21.0.1_p12 [openjdk-bin-21]
4)	Eclipse Temurin JDK 8.382_p05 [openjdk-bin-8]
Available Java Virtual Machines:
  [1]   openjdk-bin-8 
  [2]   openjdk-bin-11 
  [3]   openjdk-bin-17 
  [4]   openjdk-bin-21  system-vm

The Glorious Glasgow Haskell Compilation System, version 9.0.2
php cli (if any):
go version go1.21.5 linux/amd64

  HEAD of ::gentoo
commit ef57df2846d519557be2ca1b3df05c2823c56c55
Author: Repository mirror & CI <repomirrorci@gentoo.org>
Date:   Fri Dec 29 03:32:06 2023 +0000

    2023-12-29 03:32:05 UTC

emerge -qpvO dev-libs/intel-metrics-discovery
[ebuild     U ] dev-libs/intel-metrics-discovery-1.12.170 [1.12.165.1]
Comment 1 Toralf Förster gentoo-dev 2023-12-29 09:22:40 UTC
Created attachment 880915 [details]
emerge-info.txt
Comment 2 Toralf Förster gentoo-dev 2023-12-29 09:22:41 UTC
Created attachment 880916 [details]
dev-libs:intel-metrics-discovery-1.12.170:20231229-045211.log
Comment 3 Toralf Förster gentoo-dev 2023-12-29 09:22:42 UTC
Created attachment 880917 [details]
emerge-history.txt
Comment 4 Toralf Förster gentoo-dev 2023-12-29 09:22:43 UTC
Created attachment 880918 [details]
environment
Comment 5 Toralf Förster gentoo-dev 2023-12-29 09:22:44 UTC
Created attachment 880919 [details]
etc.clang.tar.xz
Comment 6 Toralf Förster gentoo-dev 2023-12-29 09:22:45 UTC
Created attachment 880920 [details]
etc.portage.tar.xz
Comment 7 Toralf Förster gentoo-dev 2023-12-29 09:22:46 UTC
Created attachment 880921 [details]
qlist-info.txt.xz
Comment 8 Toralf Förster gentoo-dev 2023-12-29 09:22:47 UTC
Created attachment 880922 [details]
temp.tar.xz
Comment 9 Toralf Förster gentoo-dev 2023-12-29 09:22:48 UTC
Created attachment 880923 [details]
var.tmp.clang.tar.xz
Comment 10 mitchellstevens101101 2023-12-31 12:21:38 UTC
Putting this here because I think it may be related.

I use GCC as my default compiler for this program, but I tried switching my compiler to Clang and got the exact same error as Toralf. When building with GCC instead, I get the following error:
(Note: I use LTO on my system, but the error does not change when I disable LTO)

FAILED: CMakeFiles/metrics_discovery.dir/instrumentation/metrics_discovery/codegen/md_metrics_SKL_GT3.cpp.o
/usr/lib/ccache/bin/x86_64-pc-linux-gnu-g++ -DMD_USE_PERF -DMETRICS_DISCOVERY -DNDEBUG -D_FORTIFY_SOURCE=2 -Dmetrics_discovery_EXPORTS -I/var/tmp/portage/dev-libs/intel-metrics-discovery-1.12.170/work/metrics-discovery-metrics-discovery-1.12.170/instrumentation/metrics_discovery/common/inc -I/var/tmp/portage/dev-libs/intel-metrics-discovery-1.12.170/work/metrics-discovery-metrics-discovery-1.12.170/instrumentation/metrics_discovery/common/inc/internal -I/var/tmp/portage/dev-libs/intel-metrics-discovery-1.12.170/work/metrics-discovery-metrics-discovery-1.12.170/instrumentation/metrics_discovery/common/inc/internal/concurrent_groups -I/var/tmp/portage/dev-libs/intel-metrics-discovery-1.12.170/work/metrics-discovery-metrics-discovery-1.12.170/external/drm -I/var/tmp/portage/dev-libs/intel-metrics-discovery-1.12.170/work/metrics-discovery-metrics-discovery-1.12.170/instrumentation/metrics_discovery/linux/inc -I/var/tmp/portage/dev-libs/intel-metrics-discovery-1.12.170/work/metrics-discovery-metrics-discovery-1.12.170/instrumentation/utils/common/inc -I/var/tmp/portage/dev-libs/intel-metrics-discovery-1.12.170/work/metrics-discovery-metrics-discovery-1.12.170/instrumentation/utils/linux/inc -I/var/tmp/portage/dev-libs/intel-metrics-discovery-1.12.170/work/metrics-discovery-metrics-discovery-1.12.170/inc/common -I/var/tmp/portage/dev-libs/intel-metrics-discovery-1.12.170/work/metrics-discovery-metrics-discovery-1.12.170/inc/common/instrumentation -I/var/tmp/portage/dev-libs/intel-metrics-discovery-1.12.170/work/metrics-discovery-metrics-discovery-1.12.170/inc/common/instrumentation/api -I/usr/include/libdrm -I/usr/include/libdrm/include/drm -I/usr/include/libdrm/intel  -march=native -O2 -pipe -falign-functions=32
-pipe -flto -Wl,-O1 -Wl,--as-needed -Wno-reorder -std=gnu++17 -fPIC   -O2 -Wformat -Wall -Wextra -Wformat -Wformat-security -fdiagnostics-color=auto -fstack-protector -Wno-unused -Wno-strict-aliasing -Wno-unknown-pragmas -Wno-comment -msse -Werror=format-security -Werror -fvisibility=hidden -flto -fPIC -fPIE -pie -fno-inline -Wno-extern-c-compat -MD -MT CMakeFiles/metrics_discovery.dir/instrumentation/metrics_discovery/codegen/md_metrics_SKL_GT3.cpp.o -MF CMakeFiles/metrics_discovery.dir/instrumentation/metrics_discovery/codegen/md_metrics_SKL_GT3.cpp.o.d -o CMakeFiles/metrics_discovery.dir/instrumentation/metrics_discovery/codegen/md_metrics_SKL_GT3.cpp.o -c /var/tmp/portage/dev-libs/intel-metrics-discovery-1.12.170/work/metrics-discovery-metrics-discovery-1.12.170/instrumentation/metrics_discovery/codegen/md_metrics_SKL_GT3.cpp
<command-line>: error: "_FORTIFY_SOURCE" redefined [-Werror]
<built-in>: note: this is the location of the previous definition
cc1plus: note: unrecognized command-line option ‘-Wno-extern-c-compat’ may have been intended to silence earlier diagnostics
cc1plus: all warnings being treated as errors
ninja: build stopped: subcommand failed.
 * ERROR: dev-libs/intel-metrics-discovery-1.12.170::gentoo failed (compile phase):
 *   ninja -v -j4 -l0 failed
 *
 * Call stack:
 *     ebuild.sh, line  136:  Called src_compile
 *   environment, line 3019:  Called cmake_src_compile
 *   environment, line 1772:  Called cmake_build
 *   environment, line 1739:  Called eninja
 *   environment, line 2213:  Called die
 * The specific snippet of code:
 *       "$@" || die -n "${*} failed"
 *
 * If you need support, post the output of `emerge --info '=dev-libs/intel-metrics-discovery-1.12.170::gentoo'`,
 * the complete build log and the output of `emerge -pqv '=dev-libs/intel-metrics-discovery-1.12.170::gentoo'`.
 * The complete build log is located at '/var/tmp/portage/dev-libs/intel-metrics-discovery-1.12.170/temp/build.log'.
 * The ebuild environment file is located at '/var/tmp/portage/dev-libs/intel-metrics-discovery-1.12.170/temp/environment'.
 * Working directory: '/var/tmp/portage/dev-libs/intel-metrics-discovery-1.12.170/work/metrics-discovery-metrics-discovery-1.12.170_build'
 * S: '/var/tmp/portage/dev-libs/intel-metrics-discovery-1.12.170/work/metrics-discovery-metrics-discovery-1.12.170'
Comment 11 mitchellstevens101101 2023-12-31 12:26:40 UTC
This is my emerge --info

~$ emerge --info '=dev-libs/intel-metrics-discovery-1.12.170::gentoo'

Portage 3.0.59 (python 3.11.7-final-0, default/linux/amd64/17.1/desktop, gcc-13, glibc-2.38-r8, 6.6.5-gentoo x86_64)
=================================================================
                         System Settings
=================================================================
System uname: Linux-6.6.5-gentoo-x86_64-Intel-R-_Core-TM-_i3-7100U_CPU_@_2.40GHz-with-glibc2.38
KiB Mem:     8021116 total,   2412876 free
KiB Swap:    8422396 total,   8400620 free
Timestamp of repository gentoo: Sat, 30 Dec 2023 00:45:01 +0000
Head commit of repository gentoo: 07bc8b9910d7749cc5977e3d30813d7c7c667078
Timestamp of repository lto-overlay: Wed, 27 Dec 2023 21:02:16 +0000
Head commit of repository lto-overlay: bf75d57123106dd1ab7f53cb1bce90aae236905f

Timestamp of repository mv: Wed, 27 Dec 2023 21:02:09 +0000
Head commit of repository mv: 659b384eeceb7e69cca35e9fcf4a0f8c66de1bc7

Timestamp of repository steam-overlay: Wed, 27 Dec 2023 21:02:11 +0000
Head commit of repository steam-overlay: 658adfcea7f63fccb615e1fbda4c8419d66867b9

sh bash 5.2_p21-r1
ld GNU ld (Gentoo 2.41 p4) 2.41.0
ccache version 4.8.3 [enabled]
app-misc/pax-utils:        1.3.7::gentoo
app-shells/bash:           5.2_p21-r1::gentoo
dev-java/java-config:      2.3.3-r1::gentoo
dev-lang/perl:             5.38.2-r1::gentoo
dev-lang/python:           3.10.13::gentoo, 3.11.7::gentoo, 3.12.1_p1::gentoo
dev-lang/rust:             1.74.1::gentoo
dev-util/ccache:           4.8.3::gentoo
dev-util/cmake:            3.28.1::gentoo
dev-util/meson:            1.3.1::gentoo
sys-apps/baselayout:       2.14-r1::gentoo
sys-apps/openrc:           0.52.1::gentoo
sys-apps/sandbox:          2.38::gentoo
sys-devel/autoconf:        2.13-r8::gentoo, 2.72-r1::gentoo
sys-devel/automake:        1.16.5-r1::gentoo
sys-devel/binutils:        2.41-r3::gentoo
sys-devel/binutils-config: 5.5::gentoo
sys-devel/clang:           15.0.7-r3::gentoo, 17.0.6::gentoo
sys-devel/gcc:             13.2.1_p20231014::gentoo
sys-devel/gcc-config:      2.11::gentoo
sys-devel/libtool:         2.4.7-r1::gentoo
sys-devel/lld:             15.0.7::gentoo, 17.0.6::gentoo
sys-devel/llvm:            15.0.7-r3::gentoo, 17.0.6::gentoo
sys-devel/make:            4.4.1-r1::gentoo
sys-kernel/linux-headers:  6.6::gentoo (virtual/os-headers)
sys-libs/glibc:            2.38-r8::gentoo
Repositories:

gentoo
    location: /var/db/repos/gentoo
    sync-type: rsync
    sync-uri: rsync://rsync.gentoo.org/gentoo-portage
    priority: -1000
    volatile: False
    sync-rsync-verify-max-age: 24
    sync-rsync-verify-metamanifest: yes
    sync-rsync-verify-jobs: 1
    sync-rsync-extra-opts:

lto-overlay
    location: /var/db/repos/lto-overlay
    sync-type: git
    sync-uri: https://github.com/gentoo-mirror/lto-overlay.git
    masters: gentoo mv
    volatile: False

mv
    location: /var/db/repos/mv
    sync-type: git
    sync-uri: https://github.com/gentoo-mirror/mv.git
    masters: gentoo
    volatile: False

steam-overlay
    location: /var/db/repos/steam-overlay
    sync-type: git
    sync-uri: https://github.com/gentoo-mirror/steam-overlay.git
    masters: gentoo
    volatile: False

ACCEPT_KEYWORDS="amd64 ~amd64"
ACCEPT_LICENSE="@FREE"
CBUILD="x86_64-pc-linux-gnu"
CFLAGS="-march=native -O2 -pipe -falign-functions=32 -pipe -flto"
CHOST="x86_64-pc-linux-gnu"
CONFIG_PROTECT="/etc /usr/lib64/libreoffice/program/sofficerc /usr/share/gnupg/qualified.txt"
CONFIG_PROTECT_MASK="/etc/ca-certificates.conf /etc/dconf /etc/env.d /etc/fonts/fonts.conf /etc/gconf /etc/gentoo-release /etc/revdep-rebuild /etc/sandbox.d /etc/terminfo"
CXXFLAGS="-march=native -O2 -pipe -falign-functions=32 -pipe -flto"
DISTDIR="/var/cache/distfiles"
ENV_UNSET="CARGO_HOME DBUS_SESSION_BUS_ADDRESS DISPLAY GDK_PIXBUF_MODULE_FILE GOBIN GOPATH PERL5LIB PERL5OPT PERLPREFIX PERL_CORE PERL_MB_OPT PERL_MM_OPT XAUTHORITY XDG_CACHE_HOME XDG_CONFIG_HOME XDG_DATA_HOME XDG_RUNTIME_DIR XDG_STATE_HOME"
FCFLAGS="-march=native -O2 -pipe -falign-functions=32 -pipe -flto"
FEATURES="assume-digests binpkg-docompress binpkg-dostrip binpkg-logs buildpkg-live candy ccache config-protect-if-modified distlocks ebuild-locks fixlafiles ipc-sandbox merge-sync multilib-strict network-sandbox news parallel-fetch parallel-install pid-sandbox pkgdir-index-trusted preserve-libs protect-owned qa-unresolved-soname-deps sandbox sfperms strict unknown-features-warn unmerge-logs unmerge-orphans userfetch userpriv usersandbox usersync xattr"
FFLAGS="-march=native -O2 -pipe -falign-functions=32 -pipe -flto"
GENTOO_MIRRORS="http://mirror.csclub.uwaterloo.ca/gentoo-distfiles/     http://mirror.rackspace.com/gentoo/     http://mirrors.rit.edu/gentoo/     http://mirrors.mit.edu/gentoo-distfiles/     http://www.gtlib.gatech.edu/pub/gentoo"
LANG="en_US.utf8"
LDFLAGS="-Wl,-O1 -Wl,--as-needed"
LEX="flex"
MAKEOPTS="-j4"
PKGDIR="/var/cache/binpkgs"
PORTAGE_CONFIGROOT="/"
PORTAGE_RSYNC_OPTS="--recursive --links --safe-links --perms --times --omit-dir-times --compress --force --whole-file --delete --stats --human-readable --timeout=180 --exclude=/distfiles --exclude=/local --exclude=/packages --exclude=/.git"
PORTAGE_TMPDIR="/var/tmp"
SHELL="/bin/bash"
USE="X a52 aac acl acpi alsa amd64 bluetooth branding bzip2 cairo cdda cdr cli crypt cups dbus djvu dri dts dvd dvdr elogind encode exif fdk ffmpeg flac fortran gdbm gif gpm graphite gstreamer
gtk gui hardened hwaccel iconv icu imlib ipv6 joystick jpeg lcms libnotify libtirpc lm-sensors lto mad matroska mng mp3 mp4 mpeg multilib ncurses networkmanager nls nptl ntfsdecrypt ntfsprogs offensive ogg opencl opencv opengl openmp opus pam pango pcre pdf pgo png policykit ppds pulseaudio qt5 readline sdl seccomp sound spell split-usr ssl startup-notification svg test-rust theora tiff toolbar truetype udev udisks unicode upower usb v4l v4l2 vaapi vim-syntax vorbis vulkan wifi wxwidgets x264 xattr xcb xft xinerama xml xv xvid zlib" ABI_X86="64 32" ADA_TARGET="gnat_2021" APACHE2_MODULES="authn_core authz_core socache_shmcb unixd actions alias auth_basic authn_anon authn_dbm authn_file authz_dbm authz_groupfile authz_host authz_owner authz_user autoindex cache cgi cgid dav dav_fs dav_lock deflate dir env expires ext_filter file_cache filter headers include info log_config logio mime mime_magic negotiation rewrite setenvif speling status unique_id userdir usertrack vhost_alias" CALLIGRA_FEATURES="karbon sheets words" COLLECTD_PLUGINS="df interface irq load memory rrdtool swap syslog" CPU_FLAGS_X86="aes avx avx2 f16c fma3 mmx mmxext pclmul popcnt rdrand sse sse2 sse3 sse4_1 sse4_2 ssse3" ELIBC="glibc" GPSD_PROTOCOLS="ashtech aivdm earthmate evermore fv18 garmin garmintxt gpsclock greis isync itrax mtk3301 ntrip navcom oceanserver oncore rtcm104v2 rtcm104v3 sirf skytraq superstar2 tsip tripmate tnt ublox" GRUB_PLATFORMS="efi-64 multiboot pc" INPUT_DEVICES="libinput" KERNEL="linux" L10N="en" LCD_DEVICES="bayrad cfontz glk hd44780 lb216 lcdm001 mtxorb text" LUA_SINGLE_TARGET="lua5-1" LUA_TARGETS="lua5-1" OFFICE_IMPLEMENTATION="libreoffice" PHP_TARGETS="php8-1" POSTGRES_TARGETS="postgres15" PYTHON_SINGLE_TARGET="python3_10" PYTHON_TARGETS="python3_11 python3_10" QEMU_SOFTMMU_TARGETS="aarch64 x86_64 i386 ppc" RUBY_TARGETS="ruby31" VIDEO_CARDS="intel i965 iris" XTABLES_ADDONS="quota2 psd pknock lscan length2 ipv4options ipp2p iface geoip fuzzy condition tarpit sysrq proto logmark ipmark dhcpmac delude chaos account"
Unset:  ADDR2LINE, AR, ARFLAGS, AS, ASFLAGS, CC, CCLD, CONFIG_SHELL, CPP, CPPFLAGS, CTARGET, CXX, CXXFILT, ELFEDIT, EMERGE_DEFAULT_OPTS, EXTRA_ECONF, F77FLAGS, FC, GCOV, GPROF, INSTALL_MASK, LC_ALL, LD, LFLAGS, LIBTOOL, LINGUAS, MAKE, MAKEFLAGS, NM, OBJCOPY, OBJDUMP, PORTAGE_BINHOST, PORTAGE_BUNZIP2_COMMAND, PORTAGE_COMPRESS, PORTAGE_COMPRESS_FLAGS, PORTAGE_RSYNC_EXTRA_OPTS, PYTHONPATH, RANLIB, READELF, RUSTFLAGS, SIZE, STRINGS, STRIP, YACC, YFLAGS
Comment 12 Sandi (Sandy) Vujaković 2024-01-22 23:06:19 UTC
I think that this is where it started: https://github.com/intel/metrics-discovery/commit/75b292eb1309e4ea10dce403065ee8ca5bf29ecc
Comment 13 Larry the Git Cow gentoo-dev 2024-01-23 20:07:40 UTC
The bug has been closed via the following commit(s):

https://gitweb.gentoo.org/repo/gentoo.git/commit/?id=87976c713f4cb9fde6957b005fe34406107ef63b

commit 87976c713f4cb9fde6957b005fe34406107ef63b
Author:     Conrad Kostecki <conikost@gentoo.org>
AuthorDate: 2024-01-23 20:06:54 +0000
Commit:     Conrad Kostecki <conikost@gentoo.org>
CommitDate: 2024-01-23 20:06:54 +0000

    dev-libs/intel-metrics-discovery: disable Werror
    
    Closes: https://bugs.gentoo.org/920919
    Signed-off-by: Conrad Kostecki <conikost@gentoo.org>

 ...ics-discovery-1.12.170-revert-definitions.patch | 24 ++++++++++++++++++++++
 .../intel-metrics-discovery-1.12.170.ebuild        |  7 ++-----
 2 files changed, 26 insertions(+), 5 deletions(-)