Gentoo Websites Logo
Go to: Gentoo Home Documentation Forums Lists Bugs Planet Store Wiki Get Gentoo!
Bug 911324 - dev-tcltk/tkimg-1.4.14-r2 fails test - make: [Makefile:<snip>: test] Error 2
Summary: dev-tcltk/tkimg-1.4.14-r2 fails test - make: [Makefile:<snip>: test] Error 2
Status: RESOLVED FIXED
Alias: None
Product: Gentoo Linux
Classification: Unclassified
Component: Current packages (show other bugs)
Hardware: All Linux
: Normal normal (vote)
Assignee: TCL/TK Project
URL:
Whiteboard:
Keywords: TESTFAILURE
Depends on:
Blocks:
 
Reported: 2023-07-27 16:48 UTC by Toralf Förster
Modified: 2023-09-30 18:28 UTC (History)
0 users

See Also:
Package list:
Runtime testing required: ---


Attachments
emerge-info.txt (emerge-info.txt,18.69 KB, text/plain)
2023-07-27 16:48 UTC, Toralf Förster
Details
dev-tcltk:tkimg-1.4.14-r2:20230727-155855.log (dev-tcltk:tkimg-1.4.14-r2:20230727-155855.log,248.89 KB, text/plain)
2023-07-27 16:48 UTC, Toralf Förster
Details
emerge-history.txt (emerge-history.txt,179.68 KB, text/plain)
2023-07-27 16:48 UTC, Toralf Förster
Details
environment (environment,79.23 KB, text/plain)
2023-07-27 16:48 UTC, Toralf Förster
Details
etc.clang.tar.xz (etc.clang.tar.xz,788 bytes, application/x-xz)
2023-07-27 16:48 UTC, Toralf Förster
Details
etc.portage.tar.xz (etc.portage.tar.xz,13.07 KB, application/x-xz)
2023-07-27 16:48 UTC, Toralf Förster
Details
logs.tar.xz (logs.tar.xz,35.51 KB, application/x-xz)
2023-07-27 16:48 UTC, Toralf Förster
Details
temp.tar.xz (temp.tar.xz,31.86 KB, application/x-xz)
2023-07-27 16:48 UTC, Toralf Förster
Details
tests.tar.xz (tests.tar.xz,293.27 KB, application/x-xz)
2023-07-27 16:48 UTC, Toralf Förster
Details

Note You need to log in before you can comment on or make changes to this bug.
Description Toralf Förster gentoo-dev 2023-07-27 16:48:44 UTC
    (file "bmp.test" line 10)
    invoked from within
"source $testFile"
    (file "runTest" line 15)
make[1]: *** [Makefile:254: test] Error 1
make[1]: Leaving directory '/var/tmp/portage/dev-tcltk/tkimg-1.4.14-r2/work/Img-1.4.14-Source/bmp'
make: *** [Makefile:108: test] Error 2
 * ERROR: dev-tcltk/tkimg-1.4.14-r2::gentoo failed (test phase):
 *   Make test failed. See above for details.

  -------------------------------------------------------------------

  This is an unstable amd64 chroot image at a tinderbox (==build bot)
  name: 17.1_desktop_gnome_test-20230723-154051

  -------------------------------------------------------------------

gcc-config -l:
 [1] x86_64-pc-linux-gnu-13 *
clang/llvm (if any):
clang version 16.0.6
Target: x86_64-pc-linux-gnu
Thread model: posix
InstalledDir: /usr/lib/llvm/16/bin
Configuration file: /etc/clang/clang.cfg
/usr/lib/llvm/16
16.0.6
Python 3.11.4
Available Ruby profiles:
  [1]   ruby31 (with Rubygems) *
Available Rust versions:
  [1]   rust-bin-1.71.0 *
The following VMs are available for generation-2:
*)	Eclipse Temurin JDK 8.372_p07 [openjdk-bin-8]
2)	Eclipse Temurin JRE 11.0.19_p7 [openjdk-jre-bin-11]
3)	Eclipse Temurin JRE 17.0.7_p7 [openjdk-jre-bin-17]
Available Java Virtual Machines:
  [1]   openjdk-bin-8  system-vm
  [2]   openjdk-jre-bin-11 
  [3]   openjdk-jre-bin-17 

php cli (if any):
go version go1.20.6 linux/amd64

  HEAD of ::gentoo
commit a4fe6a5132fc968826a3fe5d896f44ab661f75c6
Author: Repository mirror & CI <repomirrorci@gentoo.org>
Date:   Thu Jul 27 14:46:42 2023 +0000

    2023-07-27 14:46:41 UTC

emerge -qpvO dev-tcltk/tkimg
[ebuild  N    ] dev-tcltk/tkimg-1.4.14-r2  USE="test -doc -static-libs"
Comment 1 Toralf Förster gentoo-dev 2023-07-27 16:48:46 UTC
Created attachment 866436 [details]
emerge-info.txt
Comment 2 Toralf Förster gentoo-dev 2023-07-27 16:48:47 UTC
Created attachment 866437 [details]
dev-tcltk:tkimg-1.4.14-r2:20230727-155855.log
Comment 3 Toralf Förster gentoo-dev 2023-07-27 16:48:49 UTC
Created attachment 866438 [details]
emerge-history.txt
Comment 4 Toralf Förster gentoo-dev 2023-07-27 16:48:50 UTC
Created attachment 866439 [details]
environment
Comment 5 Toralf Förster gentoo-dev 2023-07-27 16:48:51 UTC
Created attachment 866440 [details]
etc.clang.tar.xz
Comment 6 Toralf Förster gentoo-dev 2023-07-27 16:48:51 UTC
Created attachment 866441 [details]
etc.portage.tar.xz
Comment 7 Toralf Förster gentoo-dev 2023-07-27 16:48:53 UTC
Created attachment 866442 [details]
logs.tar.xz
Comment 8 Toralf Förster gentoo-dev 2023-07-27 16:48:53 UTC
Created attachment 866443 [details]
temp.tar.xz
Comment 9 Toralf Förster gentoo-dev 2023-07-27 16:48:55 UTC
Created attachment 866444 [details]
tests.tar.xz
Comment 10 Larry the Git Cow gentoo-dev 2023-09-30 18:28:34 UTC
The bug has been closed via the following commit(s):

https://gitweb.gentoo.org/repo/gentoo.git/commit/?id=1b9df78966c36c607d25f97f10fd66189d083479

commit 1b9df78966c36c607d25f97f10fd66189d083479
Author:     Alfredo Tupone <tupone@gentoo.org>
AuthorDate: 2023-09-30 18:26:26 +0000
Commit:     Alfredo Tupone <tupone@gentoo.org>
CommitDate: 2023-09-30 18:28:20 +0000

    dev-tcltk/tkimg: add 1.4.15
    
    Closes: https://bugs.gentoo.org/911324
    Signed-off-by: Alfredo Tupone <tupone@gentoo.org>

 dev-tcltk/tkimg/Manifest                       |   1 +
 dev-tcltk/tkimg/files/tkimg-1.4.15-gcc11.patch |  10 +++
 dev-tcltk/tkimg/tkimg-1.4.15.ebuild            | 120 +++++++++++++++++++++++++
 3 files changed, 131 insertions(+)