https://blogs.gentoo.org/ago/2020/07/04/gentoo-tinderbox/ Issue: dev-python/nbval-0.10.0-r1 fails tests. Discovered on: amd64 (internal ref: ci)
Created attachment 852652 [details] build.log build log and emerge --info
Error(s) that match a know pattern: E AssertionError: Tests failed on ipynb (expected pass) FAILED tests/test_unit_tests_in_notebooks.py::test_print[/var/tmp/portage/dev-python/nbval-0.10.0-r1/work/nbval-0.10.0/tests/ipynb-test-samples/test-latex-pass-correctouput.ipynb] FAILED tests/test_unit_tests_in_notebooks.py::test_print[/var/tmp/portage/dev-python/nbval-0.10.0-r1/work/nbval-0.10.0/tests/ipynb-test-samples/test-latex-pass-failsbutignoreoutput.ipynb] FAILED tests/test_unit_tests_in_notebooks.py::test_print[/var/tmp/portage/dev-python/nbval-0.10.0-r1/work/nbval-0.10.0/tests/ipynb-test-samples/test-stream-pass-missing-unexecuted-output.ipynb] py.test: error: unrecognized arguments: --nbval --nbval-current-env
The bug has been closed via the following commit(s): https://gitweb.gentoo.org/repo/gentoo.git/commit/?id=9778da09cae03b4d98dc32722cd8953480ae87d4 commit 9778da09cae03b4d98dc32722cd8953480ae87d4 Author: jinqiang zhang <peeweep@0x0.ee> AuthorDate: 2023-03-08 19:06:03 +0000 Commit: Andrew Ammerlaan <andrewammerlaan@gentoo.org> CommitDate: 2023-03-08 19:36:19 +0000 dev-python/nbval: fix tests Closes: https://bugs.gentoo.org/895258 Signed-off-by: jinqiang zhang <peeweep@0x0.ee> Closes: https://github.com/gentoo/gentoo/pull/30003 Signed-off-by: Andrew Ammerlaan <andrewammerlaan@gentoo.org> dev-python/nbval/nbval-0.10.0-r1.ebuild | 4 ++++ 1 file changed, 4 insertions(+)