https://blogs.gentoo.org/ago/2020/07/04/gentoo-tinderbox/ Issue: dev-python/jupyter_server_fileid-0.6.0 fails tests. Discovered on: amd64 (internal ref: ci)
Created attachment 850140 [details] build.log build log and emerge --info
Error(s) that match a know pattern: E AssertionError: assert None == 'new_path/child/test_path' E AssertionError: assert None == 'new_path/test_path' FAILED tests/test_manager.py::test_get_path_oob_move_deeply_nested[False] - A... FAILED tests/test_manager.py::test_get_path_oob_move_nested[True] - Assertion...
The bug has been closed via the following commit(s): https://gitweb.gentoo.org/repo/gentoo.git/commit/?id=0260600a50c9cd8b834ccec41a1d142ff99dcaa4 commit 0260600a50c9cd8b834ccec41a1d142ff99dcaa4 Author: Andrew Ammerlaan <andrewammerlaan@gentoo.org> AuthorDate: 2023-02-13 12:58:14 +0000 Commit: Andrew Ammerlaan <andrewammerlaan@gentoo.org> CommitDate: 2023-02-13 12:58:14 +0000 dev-python/jupyter_server_fileid: restrict dep on jupyter_events Closes: https://bugs.gentoo.org/893590 Closes: https://bugs.gentoo.org/894008 Signed-off-by: Andrew Ammerlaan <andrewammerlaan@gentoo.org> ...server_fileid-0.6.0.ebuild => jupyter_server_fileid-0.6.0-r1.ebuild} | 2 +- 1 file changed, 1 insertion(+), 1 deletion(-)