Portage 3.0.30 (python 3.9.12-final-0, default/linux/x86/17.0, gcc-11.3.0, glibc-2.34-r13, 5.15.41-gentoo i686) ================================================================= System uname: Linux-5.15.41-gentoo-i686-AMD_Ryzen_7_3700X_8-Core_Processor-with-glibc2.34 KiB Mem: 32855716 total, 4952268 free KiB Swap: 0 total, 0 free Timestamp of repository gentoo: Tue, 14 Jun 2022 06:48:11 +0000 Head commit of repository gentoo: cf01ec128673a118a663c1054e633ad9705ee59b sh bash 5.1_p16 ld GNU ld (Gentoo 2.37_p1 p2) 2.37 app-misc/pax-utils: 1.3.3::gentoo app-shells/bash: 5.1_p16::gentoo dev-lang/perl: 5.34.1-r3::gentoo dev-lang/python: 2.7.18_p15::gentoo, 3.9.12::gentoo dev-lang/rust-bin: 1.60.0::gentoo dev-util/meson: 0.61.4-r2::gentoo sys-apps/baselayout: 2.8::gentoo sys-apps/openrc: 0.44.10::gentoo sys-apps/sandbox: 2.29::gentoo sys-devel/autoconf: 2.13-r1::gentoo, 2.71-r1::gentoo sys-devel/automake: 1.16.5::gentoo sys-devel/binutils: 2.37_p1-r2::gentoo sys-devel/binutils-config: 5.4.1::gentoo sys-devel/gcc: 11.3.0::gentoo sys-devel/gcc-config: 2.5-r1::gentoo sys-devel/libtool: 2.4.7::gentoo sys-devel/llvm: 13.0.1::gentoo, 14.0.4::gentoo sys-devel/make: 4.3::gentoo sys-kernel/linux-headers: 5.15-r3::gentoo (virtual/os-headers) sys-libs/glibc: 2.34-r13::gentoo Repositories: gentoo location: /var/db/repos/gentoo sync-type: git sync-uri: https://github.com/gentoo-mirror/gentoo priority: -1000 ACCEPT_KEYWORDS="x86" ACCEPT_LICENSE="*" CBUILD="i686-pc-linux-gnu" CFLAGS="-march=native -O2 -pipe" CHOST="i686-pc-linux-gnu" CONFIG_PROTECT="/etc /usr/share/gnupg/qualified.txt" CONFIG_PROTECT_MASK="/etc/ca-certificates.conf /etc/dconf /etc/env.d /etc/fonts/fonts.conf /etc/gconf /etc/gentoo-release /etc/revdep-rebuild /etc/sandbox.d /etc/terminfo" CXXFLAGS="-march=native -O2 -pipe" DISTDIR="/var/cache/distfiles" EMERGE_DEFAULT_OPTS="--autounmask=y --autounmask-continue --autounmask-use=y --autounmask-write --binpkg-changed-deps=y --buildpkg-exclude virtual --buildpkg-exclude acct-* --buildpkg-exclude sys-kernel --nospinner --jobs=8 --usepkg" ENV_UNSET="CARGO_HOME DBUS_SESSION_BUS_ADDRESS DISPLAY GOBIN GOPATH PERL5LIB PERL5OPT PERLPREFIX PERL_CORE PERL_MB_OPT PERL_MM_OPT XAUTHORITY XDG_CACHE_HOME XDG_CONFIG_HOME XDG_DATA_HOME XDG_RUNTIME_DIR" FCFLAGS="-march=native -O2 -pipe" FEATURES="assume-digests binpkg-docompress binpkg-dostrip binpkg-logs binpkg-multi-instance buildpkg buildpkg-live config-protect-if-modified distlocks ebuild-locks fixlafiles ipc-sandbox merge-sync multilib-strict network-sandbox news parallel-fetch parallel-install pid-sandbox preserve-libs protect-owned qa-unresolved-soname-deps sandbox sfperms strict strict-keepdir unknown-features-warn unmerge-logs unmerge-orphans userfetch userpriv usersandbox usersync xattr" FFLAGS="-march=native -O2 -pipe" GENTOO_MIRRORS="https://distfiles.gentoo.org" LANG="C.UTF8" LDFLAGS="-Wl,-O1 -Wl,--as-needed" LINGUAS=" en en_US en-US fi sv " MAKEOPTS="-j16" PKGDIR="/var/cache/binpkgs" PORTAGE_CONFIGROOT="/" PORTAGE_RSYNC_OPTS="--recursive --links --safe-links --perms --times --omit-dir-times --compress --force --whole-file --delete --stats --human-readable --timeout=180 --exclude=/distfiles --exclude=/local --exclude=/packages --exclude=/.git" PORTAGE_TMPDIR="/var/tmp" USE="acl bzip2 cli crypt dbus dri elogind fortran gdbm iconv ipv6 libglvnd libtirpc ncurses nptl openmp openrc pam pcre readline seccomp split-usr ssl udev unicode x86 xattr zlib" ABI_X86="32" ADA_TARGET="gnat_2020" APACHE2_MODULES="authn_core authz_core socache_shmcb unixd actions alias auth_basic authn_alias authn_anon authn_dbm authn_default authn_file authz_dbm authz_default authz_groupfile authz_host authz_owner authz_user autoindex cache cgi cgid dav dav_fs dav_lock deflate dir disk_cache env expires ext_filter file_cache filter headers include info log_config logio mem_cache mime mime_magic negotiation rewrite setenvif speling status unique_id userdir usertrack vhost_alias" CALLIGRA_FEATURES="karbon sheets words" COLLECTD_PLUGINS="df interface irq load memory rrdtool swap syslog" CPU_FLAGS_X86="aes avx avx2 f16c fma3 mmx mmxext pclmul popcnt sha sse sse2 sse3 sse4_1 sse4_2 sse4a ssse3" ELIBC="glibc" GPSD_PROTOCOLS="ashtech aivdm earthmate evermore fv18 garmin garmintxt gpsclock greis isync itrax mtk3301 nmea ntrip navcom oceanserver oldstyle oncore rtcm104v2 rtcm104v3 sirf skytraq superstar2 timing tsip tripmate tnt ublox ubx" INPUT_DEVICES="evdev" KERNEL="linux" L10N="en en_US en-US fi sv" LCD_DEVICES="bayrad cfontz cfontz633 glk hd44780 lb216 lcdm001 mtxorb ncurses text" LIBREOFFICE_EXTENSIONS="presenter-console presenter-minimizer" LLVM_TARGETS="AMDGPU BPF" LUA_SINGLE_TARGET="lua5-1" LUA_TARGETS="lua5-1" OFFICE_IMPLEMENTATION="libreoffice" PHP_TARGETS="php7-4 php8-0" POSTGRES_TARGETS="postgres12 postgres13" PYTHON_SINGLE_TARGET="python3_9" PYTHON_TARGETS="python3_9" RUBY_TARGETS="ruby27" USERLAND="GNU" VIDEO_CARDS="amdgpu radeonsi" XTABLES_ADDONS="quota2 psd pknock lscan length2 ipv4options ipset ipp2p iface geoip fuzzy condition tee tarpit sysrq proto steal rawnat logmark ipmark dhcpmac delude chaos account" Unset: ADDR2LINE, AR, ARFLAGS, AS, ASFLAGS, CC, CCLD, CONFIG_SHELL, CPP, CPPFLAGS, CTARGET, CXX, CXXFILT, ELFEDIT, EXTRA_ECONF, F77FLAGS, FC, GCOV, GPROF, INSTALL_MASK, LC_ALL, LD, LEX, LFLAGS, LIBTOOL, MAKE, MAKEFLAGS, NM, OBJCOPY, OBJDUMP, PORTAGE_BINHOST, PORTAGE_BUNZIP2_COMMAND, PORTAGE_COMPRESS, PORTAGE_COMPRESS_FLAGS, PORTAGE_RSYNC_EXTRA_OPTS, RANLIB, READELF, RUSTFLAGS, SHELL, SIZE, STRINGS, STRIP, YACC, YFLAGS
Created attachment 785006 [details] seamonkey-2.53.12:20220614-095210.log.xz
>>> Install www-client/seamonkey-2.53.12 into /var/tmp/portage/www-client/seamonkey-2.53.12/image 0:00.44 /usr/bin/gmake -C . -j16 -s -w install 0:00.45 gmake: Entering directory '/var/tmp/portage/www-client/seamonkey-2.53.12/work/seamonkey-2.53.12/seamonk' 0:00.52 gmake[1]: Entering directory '/var/tmp/portage/www-client/seamonkey-2.53.12/work/seamonkey-2.53.12/seamonk/comm/suite/installer' 0:01.09 Warning: /var/tmp/portage/www-client/seamonkey-2.53.12/work/seamonkey-2.53.12/comm/suite/installer/package-manifest.in:124: Missing file(s): bin/libmozsqlite3.so 0:12.27 ../../../dist/seamonkey/libxul.so: terminate called after throwing an instance of 'std::runtime_error' 0:12.27 what(): Segments inconsistency 0:12.31 Traceback (most recent call last): 0:12.31 File "/var/tmp/portage/www-client/seamonkey-2.53.12/work/seamonkey-2.53.12/toolkit/mozapps/installer/packager.py", line 342, in <module> 0:12.31 main() 0:12.32 File "/var/tmp/portage/www-client/seamonkey-2.53.12/work/seamonkey-2.53.12/toolkit/mozapps/installer/packager.py", line 336, in main 0:12.32 copier.copy(args.destination) 0:12.32 File "/var/tmp/portage/www-client/seamonkey-2.53.12/work/seamonkey-2.53.12/python/mozbuild/mozpack/copier.py", line 431, in copy 0:12.32 copy_results.append((destfile, f.copy(destfile, skip_if_older))) 0:12.32 File "/var/tmp/portage/www-client/seamonkey-2.53.12/work/seamonkey-2.53.12/python/mozbuild/mozpack/files.py", line 296, in copy 0:12.32 elfhack(dest) 0:12.32 File "/var/tmp/portage/www-client/seamonkey-2.53.12/work/seamonkey-2.53.12/python/mozbuild/mozpack/executables.py", line 124, in elfhack 0:12.32 errors.fatal('Error executing ' + ' '.join(cmd)) 0:12.32 File "/var/tmp/portage/www-client/seamonkey-2.53.12/work/seamonkey-2.53.12/python/mozbuild/mozpack/errors.py", line 103, in fatal 0:12.32 self._handle(self.FATAL, msg) 0:12.32 File "/var/tmp/portage/www-client/seamonkey-2.53.12/work/seamonkey-2.53.12/python/mozbuild/mozpack/errors.py", line 98, in _handle 0:12.32 raise ErrorMessage(msg) 0:12.32 mozpack.errors.ErrorMessage: Error: Error executing /var/tmp/portage/www-client/seamonkey-2.53.12/work/seamonkey-2.53.12/seamonk/build/unix/elfhack/elfhack ../../../dist/seamonkey/libxul.so 0:12.33 gmake[1]: *** [/var/tmp/portage/www-client/seamonkey-2.53.12/work/seamonkey-2.53.12/toolkit/mozapps/installer/packager.mk:19: stage-package] Error 1 0:12.33 gmake[1]: Leaving directory '/var/tmp/portage/www-client/seamonkey-2.53.12/work/seamonkey-2.53.12/seamonk/comm/suite/installer' 0:12.33 gmake: *** [/var/tmp/portage/www-client/seamonkey-2.53.12/work/seamonkey-2.53.12/comm/suite/build.mk:16: install] Error 2 0:12.33 gmake: Leaving directory '/var/tmp/portage/www-client/seamonkey-2.53.12/work/seamonkey-2.53.12/seamonk' * ERROR: www-client/seamonkey-2.53.12::gentoo failed (install phase): * (no error message) * * Call stack: * ebuild.sh, line 127: Called src_install * environment, line 4455: Called die * The specific snippet of code: * DESTDIR="${D}" ./mach install || die;
Seems to be a known issue: https://bugzilla.mozilla.org/show_bug.cgi?id=1706264 For now it seems that the only fix is to disable elfhack on x86, but that would require modifying the ebuild. How should I proceed with this in respect to the stabilization process?
(In reply to Myckel Habets from comment #3) > Seems to be a known issue: > https://bugzilla.mozilla.org/show_bug.cgi?id=1706264 > > For now it seems that the only fix is to disable elfhack on x86, but that > would require modifying the ebuild. How should I proceed with this in > respect to the stabilization process? It would be acceptable to disable it for x86 I think and not reset the stable counter, if it was very unlikely / never would have built for x86
The bug has been closed via the following commit(s): https://gitweb.gentoo.org/repo/gentoo.git/commit/?id=03277f5e8f0c9bf639cf9f8c766b7d2b06aa819e commit 03277f5e8f0c9bf639cf9f8c766b7d2b06aa819e Author: Myckel Habets <gentoo-bugs@habets-dobben.nl> AuthorDate: 2022-06-16 07:46:06 +0000 Commit: Sam James <sam@gentoo.org> CommitDate: 2022-06-16 16:30:17 +0000 www-client/seamonkey-2.53.12: disable broken elfhack on x86 build. Closes: https://bugs.gentoo.org/851933 Signed-off-by: Myckel Habets <gentoo-bugs@habets-dobben.nl> Closes: https://github.com/gentoo/gentoo/pull/25922 Signed-off-by: Sam James <sam@gentoo.org> www-client/seamonkey/seamonkey-2.53.12.ebuild | 9 +++++++-- 1 file changed, 7 insertions(+), 2 deletions(-)
The exact same problem happens also on arm64. Maybe disable elfhack on all arches? I have only known it to make trouble, and that on multiple architectures...