Gentoo Websites Logo
Go to: Gentoo Home Documentation Forums Lists Bugs Planet Store Wiki Get Gentoo!
Bug 786579 - dev-python/python-dotenv-0.17.0: fails two tests (test_run_with_existing_variable, test_run_with_existing_variable_not_overridden)
Summary: dev-python/python-dotenv-0.17.0: fails two tests (test_run_with_existing_vari...
Status: RESOLVED FIXED
Alias: None
Product: Gentoo Linux
Classification: Unclassified
Component: Current packages (show other bugs)
Hardware: All Linux
: Normal normal
Assignee: Sebastian Pipping
URL: https://github.com/theskumar/python-d...
Whiteboard:
Keywords: TESTFAILURE
Depends on:
Blocks: 786069
  Show dependency tree
 
Reported: 2021-04-29 00:26 UTC by Sam James
Modified: 2021-04-30 00:34 UTC (History)
1 user (show)

See Also:
Package list:
Runtime testing required: ---


Attachments
build.log (file_786579.txt,41.94 KB, text/plain)
2021-04-29 00:26 UTC, Sam James
Details

Note You need to log in before you can comment on or make changes to this bug.
Description Sam James archtester Gentoo Infrastructure gentoo-dev Security 2021-04-29 00:26:10 UTC
Created attachment 703491 [details]
build.log

def handle_command_exit_code(self, code):
        """ here we determine if we had an exception, or an error code that we
        weren't expecting to see.  if we did, we create and raise an exception
        """
        ca = self.call_args
        exc_class = get_exc_exit_code_would_raise(code, ca["ok_code"], ca["piped"])
        if exc_class:
            exc = exc_class(self.ran, self.process.stdout, self.process.stderr, ca["truncate_exc"])
>           raise exc
E           sh.ErrorReturnCode_1: 
E           
E             RAN: /var/tmp/portage/dev-python/python-dotenv-0.17.0/work/python-dotenv-0.17.0-python3_7/test/scripts/dotenv run --no-override printenv a
E           
E             STDOUT:
E           
E           
E             STDERR:
E           Traceback (most recent call last):
E             File "/var/tmp/portage/dev-python/python-dotenv-0.17.0/work/python-dotenv-0.17.0-python3_7/test/scripts/dotenv", line 33, in <module>
E               sys.exit(load_entry_point('python-dotenv==0.17.0', 'console_scripts', 'dotenv')())
E             File "/var/tmp/portage/dev-python/python-dotenv-0.17.0/work/python-dotenv-0.17.0-python3_7/test/scripts/dotenv", line 22, in importlib_load_entry_point
E               for entry_point in distribution(dist_name).entry_points
E             File "/usr/lib/python3.7/site-packages/importlib_metadata/__init__.py", line 767, in distribution
E               return Distribution.from_name(distribution_name)
E             File "/usr/lib/python3.7/site-packages/importlib_metadata/__init__.py", line 386, in from_name
E               raise PackageNotFoundErr... (98 more, please see e.stderr)

----

=========================== short test summary info ============================
FAILED tests/test_cli.py::test_run_with_existing_variable - sh.ErrorReturnCod...
FAILED tests/test_cli.py::test_run_with_existing_variable_not_overridden - sh...
================== 2 failed, 129 passed, 3 warnings in 3.29s ===================

----
Portage 3.0.18 (python 3.8.8-final-0, default/linux/amd64/17.1/desktop/plasma, gcc-10.2.0, glibc-2.32-r7, 4.14.34-gentoo-infra38 x86_64)
=================================================================
System uname: Linux-4.14.34-gentoo-infra38-x86_64-Intel-R-_Xeon-R-_CPU_E5-2620_v4_@_2.10GHz-with-glibc2.2.5
KiB Mem:    16426740 total,   3443336 free
KiB Swap:    4194268 total,   4155960 free
Timestamp of repository gentoo: Wed, 28 Apr 2021 23:50:11 +0000
sh bash 5.0_p18
ld GNU ld (Gentoo 2.35.2 p1) 2.35.2
ccache version 4.2 [disabled]
app-shells/bash:          5.0_p18::gentoo
dev-java/java-config:     2.3.1::gentoo
dev-lang/perl:            5.30.3::gentoo
dev-lang/python:          3.7.10_p1::gentoo, 3.8.8_p1::gentoo, 3.9.2_p1::gentoo
dev-lang/rust-bin:        1.51.0::gentoo
dev-util/ccache:          4.2::gentoo
dev-util/cmake:           3.18.5::gentoo
sys-apps/baselayout:      2.7::gentoo
sys-apps/openrc:          0.42.1-r1::gentoo
sys-apps/sandbox:         2.21::gentoo
sys-devel/autoconf:       2.13-r1::gentoo, 2.69-r5::gentoo
sys-devel/automake:       1.16.2-r1::gentoo
sys-devel/binutils:       2.35.2::gentoo
sys-devel/gcc:            10.2.0-r5::gentoo
sys-devel/gcc-config:     2.4::gentoo
sys-devel/libtool:        2.4.6-r6::gentoo
sys-devel/make:           4.3::gentoo
sys-kernel/linux-headers: 5.10::gentoo (virtual/os-headers)
sys-libs/glibc:           2.32-r7::gentoo
Repositories:

gentoo
    location: /bound/portage
    sync-type: rsync
    sync-uri: rsync://rsync.gentoo.org/gentoo-portage
    priority: -1000
    sync-rsync-extra-opts:
    sync-rsync-verify-jobs: 1
    sync-rsync-verify-max-age: 24
    sync-rsync-verify-metamanifest: yes

ACCEPT_KEYWORDS="amd64"
ACCEPT_LICENSE="*"
CBUILD="x86_64-pc-linux-gnu"
CFLAGS="-O2 -pipe -march=native -fdiagnostics-color=always -frecord-gcc-switches"
CHOST="x86_64-pc-linux-gnu"
CONFIG_PROTECT="/etc /usr/share/config /usr/share/gnupg/qualified.txt"
CONFIG_PROTECT_MASK="/etc/ca-certificates.conf /etc/dconf /etc/env.d /etc/fonts/fonts.conf /etc/gconf /etc/gentoo-release /etc/revdep-rebuild /etc/sandbox.d /etc/terminfo /etc/texmf/language.dat.d /etc/texmf/language.def.d /etc/texmf/updmap.d /etc/texmf/web2c"
CXXFLAGS="-O2 -pipe -march=native -fdiagnostics-color=always -frecord-gcc-switches"
DISTDIR="/bound/distfiles"
EMERGE_DEFAULT_OPTS="--complete-graph --with-bdeps=y --keep-going --deep"
ENV_UNSET="CARGO_HOME DBUS_SESSION_BUS_ADDRESS DISPLAY GOBIN GOPATH PERL5LIB PERL5OPT PERLPREFIX PERL_CORE PERL_MB_OPT PERL_MM_OPT XAUTHORITY XDG_CACHE_HOME XDG_CONFIG_HOME XDG_DATA_HOME XDG_RUNTIME_DIR"
FCFLAGS="-O2 -pipe -march=native -fdiagnostics-color=always -frecord-gcc-switches"
FEATURES="assume-digests binpkg-docompress binpkg-dostrip binpkg-logs cgroup config-protect-if-modified distlocks ebuild-locks fixlafiles ipc-sandbox merge-sync multilib-strict network-sandbox news parallel-fetch parallel-install pid-sandbox preserve-libs protect-owned qa-unresolved-soname-deps sandbox sfperms strict unknown-features-warn unmerge-logs unmerge-orphans userfetch userpriv usersandbox usersync xattr"
FFLAGS="-O2 -pipe -march=native -fdiagnostics-color=always -frecord-gcc-switches"
GENTOO_MIRRORS="http://distfiles.gentoo.org"
LANG="en_US.utf8"
LDFLAGS="-O2 -pipe -march=native -fdiagnostics-color=always -frecord-gcc-switches -Wl,--defsym=__gentoo_check_ldflags__=0 -Wl,-O1 -Wl,--as-needed"
MAKEOPTS="-j9 -l9"
PKGDIR="/var/cache/binpkgs"
PORTAGE_CONFIGROOT="/"
PORTAGE_RSYNC_OPTS="--recursive --links --safe-links --perms --times --omit-dir-times --compress --force --whole-file --delete --stats --human-readable --timeout=180 --exclude=/distfiles --exclude=/local --exclude=/packages --exclude=/.git"
PORTAGE_TMPDIR="/var/tmp"
USE="X a52 aac acl acpi activities alsa amd64 asm berkdb bluetooth branding bzip2 cairo caps cdda cdr cli crypt cups dbus declarative dri dts dvd dvdr egl elogind emboss encode exif filecaps flac fortran gdbm gif gles2 gmp gpm graphite gtk gui iconv icu introspection ipv6 jit jpeg kde kipi kwallet lcms libglvnd libnotify libtirpc mad mng mp3 mp4 mpeg multilib ncurses nls nptl objc ogg opengl openmp pam pango pcre pdf phonon plasma png policykit polkit ppds pulseaudio qml qt5 readline sdl seccomp semantic-desktop spell split-usr ssl startup-notification svg tcpd threads tiff truetype udev udisks unicode upower usb vorbis wayland widgets wxwidgets x264 xattr xcb xml xv xvid xwayland zlib" ABI_X86="32 64" ADA_TARGET="gnat_2018" ALSA_CARDS="ali5451 als4000 atiixp atiixp-modem bt87x ca0106 cmipci emu10k1x ens1370 ens1371 es1938 es1968 fm801 hda-intel intel8x0 intel8x0m maestro3 trident usb-audio via82xx via82xx-modem ymfpci" APACHE2_MODULES="authn_core authz_core socache_shmcb unixd actions alias auth_basic authn_alias authn_anon authn_dbm authn_default authn_file authz_dbm authz_default authz_groupfile authz_host authz_owner authz_user autoindex cache cgi cgid dav dav_fs dav_lock deflate dir disk_cache env expires ext_filter file_cache filter headers include info log_config logio mem_cache mime mime_magic negotiation rewrite setenvif speling status unique_id userdir usertrack vhost_alias" CALLIGRA_FEATURES="karbon sheets words" COLLECTD_PLUGINS="df interface irq load memory rrdtool swap syslog" CPU_FLAGS_X86="aes avx avx2 f16c fma3 mmx mmxext pclmul popcnt sse sse2 sse3 sse4_1 sse4_2 ssse3" ELIBC="glibc" GPSD_PROTOCOLS="ashtech aivdm earthmate evermore fv18 garmin garmintxt gpsclock greis isync itrax mtk3301 nmea ntrip navcom oceanserver oldstyle oncore rtcm104v2 rtcm104v3 sirf skytraq superstar2 timing tsip tripmate tnt ublox ubx" INPUT_DEVICES="libinput" KERNEL="linux" LCD_DEVICES="framebuffer" LIBREOFFICE_EXTENSIONS="presenter-console presenter-minimizer" LUA_SINGLE_TARGET="lua5-1" LUA_TARGETS="lua5-1" OFFICE_IMPLEMENTATION="libreoffice" PHP_TARGETS="php7-3 php7-4" POSTGRES_TARGETS="postgres12" PYTHON_SINGLE_TARGET="python3_8" PYTHON_TARGETS="python3_8 python3_6 python3_7 python3_9" RUBY_TARGETS="ruby26" USERLAND="GNU" VIDEO_CARDS="amdgpu fbdev intel nouveau radeon radeonsi vesa dummy v4l" XTABLES_ADDONS="quota2 psd pknock lscan length2 ipv4options ipset ipp2p iface geoip fuzzy condition tee tarpit sysrq proto steal rawnat logmark ipmark dhcpmac delude chaos account"
Unset:  CC, CPPFLAGS, CTARGET, CXX, INSTALL_MASK, LC_ALL, LINGUAS, PORTAGE_BINHOST, PORTAGE_BUNZIP2_COMMAND, PORTAGE_COMPRESS, PORTAGE_COMPRESS_FLAGS, PORTAGE_RSYNC_EXTRA_OPTS, RUSTFLAGS
Comment 1 Sebastian Pipping gentoo-dev 2021-04-29 18:04:54 UTC
I cannot push right now but I do have a fix and reported the problem upstream juts now.
Comment 2 Sebastian Pipping gentoo-dev 2021-04-29 18:07:05 UTC
(In reply to Sebastian Pipping from comment #1)
> I cannot push right now but I do have a fix and reported the problem
> upstream juts now.

Sorry, should I have said "confirmed and extended an existing report" to be precise.  What I did report upstream is the related issue on setuptools (https://github.com/pypa/setuptools/issues/2661).
Comment 3 Larry the Git Cow gentoo-dev 2021-04-30 00:26:44 UTC
The bug has been closed via the following commit(s):

https://gitweb.gentoo.org/repo/gentoo.git/commit/?id=bb5efcb600c590d49006f1b5d3593809534ba74e

commit bb5efcb600c590d49006f1b5d3593809534ba74e
Author:     Sebastian Pipping <sping@gentoo.org>
AuthorDate: 2021-04-29 22:38:11 +0000
Commit:     Sebastian Pipping <sping@gentoo.org>
CommitDate: 2021-04-30 00:26:33 +0000

    dev-python/python-dotenv: 0.17.1 + fix tests
    
    Closes: https://bugs.gentoo.org/786579
    Signed-off-by: Sebastian Pipping <sping@gentoo.org>
    Package-Manager: Portage-3.0.18, Repoman-3.0.3

 dev-python/python-dotenv/Manifest                  |  1 +
 .../python-dotenv/python-dotenv-0.17.1.ebuild      | 29 ++++++++++++++++++++++
 2 files changed, 30 insertions(+)
Comment 4 Sam James archtester Gentoo Infrastructure gentoo-dev Security 2021-04-30 00:34:40 UTC
Wow, thanks for the speedy fix!